/work/gcc-4.1.1/gcc/c-lex.c -o c-lex.o /var/tmp/portage/sys-devel/gcc-4.1.1-r3/temp/cciz9o4o.s: Assembler messages: /var/tmp/portage/sys-devel/gcc-4.1.1-r3/temp/cciz9o4o.s:2962: Error: invalid sections for operation on `.LCFI22' and `.LCFI21' /var/tmp/portage/sys-devel/gcc-4.1.1-r3/temp/cciz9o4o.s:3031: Error: invalid sections for operation on `.LCFI38' and `.LCFI37' /var/tmp/portage/sys-devel/gcc-4.1.1-r3/temp/cciz9o4o.s:3221: Error: invalid sections for operation on `.LCFI75' and `.LCFI74' /var/tmp/portage/sys-devel/gcc-4.1.1-r3/temp/cciz9o4o.s:3258: Error: invalid sections for operation on `.LCFI82' and `.LCFI81' make[2]: *** [c-lex.o] Error 1 make[2]: Leaving directory `/var/tmp/portage/sys-devel/gcc-4.1.1-r3/work/build/gcc' make[1]: *** [stagefeedback_build] Error 2 make[1]: Leaving directory `/var/tmp/portage/sys-devel/gcc-4.1.1-r3/work/build/gcc' make: *** [profiledbootstrap] Error 2 !!! ERROR: sys-devel/gcc-4.1.1-r3 failed. Call stack: ebuild.sh, line 1614: Called dyn_compile ebuild.sh, line 971: Called qa_call 'src_compile' environment, line 5337: Called src_compile ebuild.sh, line 1304: Called toolchain_src_compile toolchain.eclass, line 26: Called gcc_src_compile toolchain.eclass, line 1550: Called gcc_do_make toolchain.eclass, line 1424: Called die !!! emake failed with profiledbootstrap !!! If you need support, post the topmost build error, and the call stack if relevant. !!! A complete build log is located at '/var/tmp/portage/sys-devel/gcc-4.1.1-r3/temp/build.log'.