/home/edd/zaptel-1.4.0/zttranscode.c: In function âztc_releaseâ: /home/edd/zaptel-1.4.0/zttranscode.c:208: error: invalid use of undefined type âstruct pageâ /home/edd/zaptel-1.4.0/zttranscode.c:209: error: invalid use of undefined type âstruct pageâ /home/edd/zaptel-1.4.0/zttranscode.c:210: error: increment of pointer to unknown structure /home/edd/zaptel-1.4.0/zttranscode.c:210: error: arithmetic on pointer to an incomplete type /home/edd/zaptel-1.4.0/zttranscode.c:211: warning: implicit declaration of function âClearPageReservedâ /home/edd/zaptel-1.4.0/zttranscode.c: In function âzt_tc_mmapâ: /home/edd/zaptel-1.4.0/zttranscode.c:370: error: dereferencing pointer to incomplete type /home/edd/zaptel-1.4.0/zttranscode.c:376: error: dereferencing pointer to incomplete type /home/edd/zaptel-1.4.0/zttranscode.c:376: error: dereferencing pointer to incomplete type /home/edd/zaptel-1.4.0/zttranscode.c:378: error: dereferencing pointer to incomplete type /home/edd/zaptel-1.4.0/zttranscode.c:378: error: dereferencing pointer to incomplete type /home/edd/zaptel-1.4.0/zttranscode.c:384: warning: implicit declaration of function âremap_pfn_rangeâ /home/edd/zaptel-1.4.0/zttranscode.c:384: error: dereferencing pointer to incomplete type /home/edd/zaptel-1.4.0/zttranscode.c:384: error: âPAGE_SHAREDâ undeclared (first use in this function) /home/edd/zaptel-1.4.0/zttranscode.c:384: error: (Each undeclared identifier is reported only once /home/edd/zaptel-1.4.0/zttranscode.c:384: error: for each function it appears in.) make[3]: *** [/home/edd/zaptel-1.4.0/zttranscode.o] Error 1 make[2]: *** [_module_/home/edd/zaptel-1.4.0] Error 2 make[2]: Leaving directory `/usr/src/linux-headers-2.6.20-12-generic' make[1]: *** [linux26] Error 2 make[1]: Leaving directory `/home/edd/zaptel-1.4.0' make: *** [all] Error 2