atom.c: In function `FreeAllAtoms': atom.c:190: error: called object is not a function atom.c:193: error: called object is not a function atom.c:194: error: called object is not a function atom.c:195: error: syntax error before ')' token atom.c:196: error: `None' undeclared (first use in this function) atom.c: In function `InitAtoms': atom.c:204: error: syntax error before ')' token atom.c:207: error: `None' undeclared (first use in this function) atom.c:207: error: called object is not a function atom.c:209: error: `XA_LAST_PREDEFINED' undeclared (first use in this function) make[1]: *** [atom.lo] Error 1 make[1]: Leaving directory `/var/tmp/portage/x11-base/xorg-server-1.1.1-r4/work/xorg-server-1.1.1/dix' make: *** [all-recursive] Error 1 !!! ERROR: x11-base/xorg-server-1.1.1-r4 failed. Call stack: ebuild.sh, line 1614: Called dyn_compile ebuild.sh, line 971: Called qa_call 'src_compile' environment, line 3967: Called src_compile ebuild.sh, line 1304: Called x-modular_src_compile x-modular.eclass, line 333: Called x-modular_src_make x-modular.eclass, line 328: Called die !!! emake failed !!! If you need support, post the topmost build error, and the call stack if relevant. !!! A complete build log is located at '/var/tmp/portage/x11-base/xorg-server-1.1.1-r4/temp/build.log'.