t/read............ok 1/45Readimage (reference/read/input_gif.miff): Exception 425: Improper image header `reference/read/input_gif.miff' at t/subroutines.pl line 359. t/read............NOK 7Readimage (reference/read/input_gif87.miff): Exception 425: Improper image header `reference/read/input_gif87.miff' at t/subroutines.pl line 359. t/read............NOK 8Readimage (reference/read/granite.miff): Exception 425: Unexpected end-of-file `reference/read/granite.miff': No such file or directory at t/subroutines.pl line 359. t/read............ok 11/45Readimage (input.xwd): Exception 420: no decode delegate for this image format `input.xwd' at t/subroutines.pl line 342. t/read............FAILED tests 7-8, 10, 39 Failed 4/45 tests, 91.11% okay t/setattribute....ok t/write...........FAILED test 29 Failed 1/33 tests, 96.97% okay Failed Test Stat Wstat Total Fail Failed List of Failed ------------------------------------------------------------------------------- t/read.t 45 4 8.89% 7-8 10 39 t/write.t 33 1 3.03% 29 Failed 2/10 test scripts, 80.00% okay. 5/275 subtests failed, 98.18% okay. make[2]: *** [test_dynamic] Fehler 255 make[2]: Verlasse Verzeichnis '/home/padi/rpm/ImageMagick/ImageMagick-6.3.3/PerlMagick' make[1]: *** [check-perl] Fehler 2 make[1]: Verlasse Verzeichnis '/home/padi/rpm/ImageMagick/ImageMagick-6.3.3' make: *** [check-am] Fehler 2