evas.c:264: error: ‘struct Current_State’ has no member named ‘eps’ evas.c:279: warning: implicit declaration of function ‘engrave_part_state_rel2_to_x_get’ evas.c:279: error: ‘struct Current_State’ has no member named ‘eps’ evas.c:280: error: ‘struct Current_State’ has no member named ‘eg’ evas.c:281: error: ‘struct Current_State’ has no member named ‘eps’ evas.c:296: warning: implicit declaration of function ‘engrave_part_state_rel2_to_y_get’ evas.c:296: error: ‘struct Current_State’ has no member named ‘eps’ evas.c:297: error: ‘struct Current_State’ has no member named ‘eg’ evas.c:298: error: ‘struct Current_State’ has no member named ‘eps’ evas.c: In function ‘ev_resize_fake’: evas.c:340: warning: implicit declaration of function ‘engrave_group_max_size_get’ evas.c:340: error: ‘struct Current_State’ has no member named ‘eg’ evas.c:341: warning: implicit declaration of function ‘engrave_group_min_size_get’ evas.c:341: error: ‘struct Current_State’ has no member named ‘eg’ evas.c: In function ‘ev_redraw’: evas.c:372: error: ‘struct Current_State’ has no member named ‘eg’ make[3]: *** [evas.o] Error 1 make[3]: *** Waiting for unfinished jobs.... make[3]: *** [callbacks.o] Error 1 make[3]: Leaving directory `/media/datalow/PROJECTS/e17/cvs/e17/proto/edje_editor/src/bin' make[2]: *** [all-recursive] Error 1 make[2]: Leaving directory `/media/datalow/PROJECTS/e17/cvs/e17/proto/edje_editor/src' make[1]: *** [all-recursive] Error 1 make[1]: Leaving directory `/media/datalow/PROJECTS/e17/cvs/e17/proto/edje_editor' make: *** [all] Error 2