.deps/Screen.Tpo make[4]: *** [Screen.o] Error 1 make[4]: Leaving directory `/var/tmp/portage/fluxbox-0.9.14-r1/work/fluxbox-0.9.14/src' make[3]: *** [all-recursive] Error 1 make[3]: Leaving directory `/var/tmp/portage/fluxbox-0.9.14-r1/work/fluxbox-0.9.14/src' make[2]: *** [all] Error 2 make[2]: Leaving directory `/var/tmp/portage/fluxbox-0.9.14-r1/work/fluxbox-0.9.14/src' make[1]: *** [all-recursive] Error 1 make[1]: Leaving directory `/var/tmp/portage/fluxbox-0.9.14-r1/work/fluxbox-0.9.14' make: *** [all] Error 2 !!! ERROR: x11-wm/fluxbox-0.9.14-r1 failed. !!! Function src_compile, Line 90, Exitcode 2 !!! make failed !!! If you need support, post the topmost build error, NOT this status message.