In file included from recordingselector.cpp:22: /usr/local/include/mythtv/libmythtv/programinfo.h:5:23: mythdbcon.h: No such file or directory In file included from recordingselector.cpp:22: /usr/local/include/mythtv/libmythtv/programinfo.h:350: error: `MSqlBindings' has not been declared /usr/local/include/mythtv/libmythtv/programinfo.h:352: error: `MSqlBindings' has not been declared /usr/local/include/mythtv/libmythtv/programinfo.h:359: error: `MSqlBindings' has not been declared recordingselector.cpp: In member function `void RecordingSelector::OKPressed()': recordingselector.cpp:315: error: `MSqlQuery' was not declared in this scope recordingselector.cpp:315: error: expected `;' before "query" recordingselector.cpp:316: error: `query' was not declared in this scope recordingselector.cpp:315: warning: unused variable 'MSqlQuery' recordingselector.cpp: In member function `void RecordingSelector::updateSelectedList()': recordingselector.cpp:445: error: `MSqlQuery' was not declared in this scope recordingselector.cpp:445: error: expected `;' before "query" recordingselector.cpp:446: error: `query' was not declared in this scope recordingselector.cpp:445: warning: unused variable 'MSqlQuery' make[2]: *** [recordingselector.o] Error 1 make[2]: Leaving directory `/usr/local/src/mythplugins.fixes.13145/mytharchive/mytharchive' make[1]: *** [sub-mytharchive] Error 2 make[1]: Leaving directory `/usr/local/src/mythplugins.fixes.13145/mytharchive' make: *** [sub-mytharchive] Error 2