======================================================================
FAIL: test.rdfa.all_tests:()
----------------------------------------------------------------------
Traceback (most recent call last):
File "/usr/lib/python2.4/site-packages/nose-0.9.2-py2.4.egg/nose/case.py", line 52, in runTest
self.testFunc()
File "/usr/lib/python2.4/site-packages/nose-0.9.2-py2.4.egg/nose/loader.py", line 326, in run
expr[0](*expr[1:])
File "/home/eliast/work/rdflib-trunk/test/rdfa.py", line 91, in runTest
"In %s: results do not match.\n%s\n\n%s" % (self.shortDescription(), pcontents, qcontents))
AssertionError: In 000005: results do not match.
"Internet Applications".
.
.
_:span0 "Internet Applications".
======================================================================
FAIL: /home/eliast/work/rdflib-trunk: test.rdfa.all_tests:()
----------------------------------------------------------------------
Traceback (most recent call last):
File "/usr/lib/python2.4/site-packages/nose-0.9.2-py2.4.egg/nose/case.py", line 52, in runTest
self.testFunc()
File "/usr/lib/python2.4/site-packages/nose-0.9.2-py2.4.egg/nose/loader.py", line 326, in run
expr[0](*expr[1:])
File "/home/eliast/work/rdflib-trunk/test/rdfa.py", line 91, in runTest
"In %s: results do not match.\n%s\n\n%s" % (self.shortDescription(), pcontents, qcontents))
AssertionError: In 000014: results do not match.
"chat"@fr.
"chat".
======================================================================
FAIL: /home/eliast/work/rdflib-trunk: test.rdfa.all_tests:()
----------------------------------------------------------------------
Traceback (most recent call last):
File "/usr/lib/python2.4/site-packages/nose-0.9.2-py2.4.egg/nose/case.py", line 52, in runTest
self.testFunc()
File "/usr/lib/python2.4/site-packages/nose-0.9.2-py2.4.egg/nose/loader.py", line 326, in run
expr[0](*expr[1:])
File "/home/eliast/work/rdflib-trunk/test/rdfa.py", line 91, in runTest
"In %s: results do not match.\n%s\n\n%s" % (self.shortDescription(), pcontents, qcontents))
AssertionError: In 000015: results do not match.
"chat"@fr.
"chat".
----------------------------------------------------------------------
Ran 122 tests in 24.863s
FAILED (failures=6, errors=38)