make[4]: Entering directory `/home/bobi/amarok-1.4-beta1/amarok/src' /bin/sh ../../libtool --silent --tag=CXX --mode=link g++ -Wno-long-long -Wundef -ansi -D_XOPEN_SOURCE=500 -D_BSD_SOURCE -Wcast-align -Wconversion -Wchar-subscripts -Wall -W -Wpointer-arith -O2 -Wformat-security -Wmissing-format-attribute -Wno-non-virtual-dtor -fno-exceptions -fno-check-new -fno-common -DQT_CLEAN_NAMESPACE -DQT_NO_ASCII_CAST -DQT_NO_STL -DQT_NO_COMPAT -DQT_NO_TRANSLATION -o amarokapp main.o ../../amarok/src/amarokcore/libamarokcore.la ../../amarok/src/libamarok.la ../../amarok/src/analyzers/libanalyzers.la ../../amarok/src/engine/libengine.la ../../amarok/src/plugin/libplugin.la ../../amarok/src/statusbar/libstatusbar.la ../../amarok/src/metadata/libmetadata.la -lkutils -lkio -lkdeui -lkdecore -lkhtml -lknewstuff -L/usr/local/lib -ltag -lGL ../../amarok/src/sqlite/libsqlite.la ../../amarok/src/.libs/libamarok.so: undefined reference to `TagLib::FileRef::addFileTypeResolver(TagLib::FileRef::FileTypeResolver const*)' collect2: ld returned 1 exit status make[4]: *** [amarokapp] Error 1 make[4]: Leaving directory `/home/bobi/amarok-1.4-beta1/amarok/src' make[3]: *** [all-recursive] Error 1 make[3]: Leaving directory `/home/bobi/amarok-1.4-beta1/amarok/src' make[2]: *** [all-recursive] Error 1 make[2]: Leaving directory `/home/bobi/amarok-1.4-beta1/amarok' make[1]: *** [all-recursive] Error 1 make[1]: Leaving directory `/home/bobi/amarok-1.4-beta1' make: *** [all] Error 2