{standard input}: Assembler messages: {standard input}:6067: Warning: end of file not at end of a line; newline inserted {standard input}:5918: Error: undefined symbol `.LLSDACSE3433' in operation {standard input}:6170: Error: undefined symbol `.L' in operation g++: Internal error: Speicherzugriffsfehler (program cc1plus) Please submit a full bug report. See for instructions. make[2]: *** [upnp.o] Fehler 1 make[2]: Leaving directory `/home/mmichna/Desktop/mythtv-0.20/libs/libmythupnp' make[1]: *** [sub-libmythupnp] Fehler 2 make[1]: Leaving directory `/home/mmichna/Desktop/mythtv-0.20/libs' make: *** [sub-libs] Fehler 2