/usr/lib/tcl8.4/include/generic/tclIntDecls.h:377: error: expected ‘)’ before ‘->’ token make: *** [tkArgv.o] Error 1 make: *** Waiting for unfinished jobs.... /var/tmp/portage/dev-lang/tk-8.4.14/work/tk8.4.14/unix/../generic/tk3d.c: In function ‘Tk_3DBorderGC’: /var/tmp/portage/dev-lang/tk-8.4.14/work/tk8.4.14/unix/../generic/tk3d.c:395: warning: implicit declaration of function ‘panic’ make: *** [tk3d.o] Error 1 !!! ERROR: dev-lang/tk-8.4.14 failed. Call stack: ebuild.sh, line 1614: Called dyn_compile ebuild.sh, line 971: Called qa_call 'src_compile' ebuild.sh, line 44: Called src_compile tk-8.4.14.ebuild, line 67: Called die !!! (no error message) !!! If you need support, post the topmost build error, and the call stack if relevant. !!! A complete build log is located at '/var/tmp/portage/dev-lang/tk-8.4.14/temp/build.log'.