if gcc -DHAVE_CONFIG_H -I. -I. -I.. -I.. -pthread -I/usr/include/gstreamer-0.10 -I/usr/include/glib-2.0 -I/usr/lib/glib-2.0/include -I/usr/include/libxml2 -Wall -Werror -g -O2 -MT test_rtp_jingle-test-jingle.o -MD -MP -MF ".deps/test_rtp_jingle-test-jingle.Tpo" -c -o test_rtp_jingle-test-jingle.o `test -f 'test-jingle.c' || echo './'`test-jingle.c; \ then mv -f ".deps/test_rtp_jingle-test-jingle.Tpo" ".deps/test_rtp_jingle-test-jingle.Po"; else rm -f ".deps/test_rtp_jingle-test-jingle.Tpo"; exit 1; fi test-jingle.c:30:37: error: gst/interfaces/xoverlay.h: No such file or directory cc1: warnings being treated as errors test-jingle.c: In function ‘set_xoverlay’: test-jingle.c:474: warning: implicit declaration of function ‘gst_x_overlay_set_xwindow_id’ test-jingle.c:474: warning: implicit declaration of function ‘GST_X_OVERLAY’ make[2]: *** [test_rtp_jingle-test-jingle.o] Error 1 make[2]: Leaving directory `/home/infoglobe/telepathy/farsight/tests' make[1]: *** [all-recursive] Error 1 make[1]: Leaving directory `/home/infoglobe/telepathy/farsight' make: *** [all] Error 2