In file included from ./tm.h:4, from /var/tmp/portage/sys-devel/gcc-4.1.1-r3/work/gcc-4.1.1/gcc/genmddeps.c:21: ./options.h:376: error: redeclaration of enumerator 'OP___' ./options.h:375: error: previous definition of 'OP___' was here ./options.h:801: error: redeclaration of enumerator 'OP__f_rap_' ./options.h:751: error: previous definition of 'OP__f_rap_' was here ./options.h:909: error: redeclaration of enumerator 'OP___' ./options.h:376: error: previous definition of 'OP___' was here ./options.h:911: error: redeclaration of enumerator 'OP___' ./options.h:909: error: previous definition of 'OP___' was here make[2]: *** [build/genmddeps.o] Error 1 make[2]: Leaving directory `/var/tmp/portage/sys-devel/gcc-4.1.1-r3/work/build/gcc' make[1]: *** [stage1_build] Error 2 make[1]: Leaving directory `/var/tmp/portage/sys-devel/gcc-4.1.1-r3/work/build/gcc' make: *** [profiledbootstrap] Error 2 !!! ERROR: sys-devel/gcc-4.1.1-r3 failed. Call stack: ebuild.sh, line 1614: Called dyn_compile ebuild.sh, line 971: Called qa_call 'src_compile' environment, line 5316: Called src_compile ebuild.sh, line 1304: Called toolchain_src_compile toolchain.eclass, line 26: Called gcc_src_compile toolchain.eclass, line 1550: Called gcc_do_make toolchain.eclass, line 1424: Called die !!! emake failed with profiledbootstrap !!! If you need support, post the topmost build error, and the call stack if relevant. !!! A complete build log is located at '/var/tmp/portage/sys-devel/gcc-4.1.1-r3/temp/build.log'.