rm -rf debian/tmp install -d debian/tmp/DEBIAN debian/tmp/usr/share/doc/evolution-remove-duplicates-plugin /usr/bin/make INSTALL_PROGRAM="install -s" \ prefix=$(pwd)/debian/tmp/usr install make[1]: Entering directory `/tmp/buildd/evolution-remove-duplicates-plugin-0.0.2' Making install in src make[2]: Entering directory `/tmp/buildd/evolution-remove-duplicates-plugin-0.0.2/src' make[3]: Entering directory `/tmp/buildd/evolution-remove-duplicates-plugin-0.0.2/src' make[3]: Nothing to be done for `install-exec-am'. /bin/bash ../mkinstalldirs /usr/lib/evolution/2.10/plugins /bin/bash ../libtool --mode=install /usr/bin/install -c liborg-gnome-remove-duplicates.la /usr/lib/evolution/2.10/plugins/liborg-gnome-remove-duplicates.la /usr/bin/install -c .libs/liborg-gnome-remove-duplicates.so /usr/lib/evolution/2.10/plugins/liborg-gnome-remove-duplicates.so /usr/bin/install: cannot create regular file `/usr/lib/evolution/2.10/plugins/liborg-gnome-remove-duplicates.so': Permission denied make[3]: *** [install-pluginLTLIBRARIES] Error 1 make[3]: Leaving directory `/tmp/buildd/evolution-remove-duplicates-plugin-0.0.2/src' make[2]: *** [install-am] Error 2 make[2]: Leaving directory `/tmp/buildd/evolution-remove-duplicates-plugin-0.0.2/src' make[1]: *** [install-recursive] Error 1 make[1]: Leaving directory `/tmp/buildd/evolution-remove-duplicates-plugin-0.0.2' make: *** [binary-arch] Error 2 pbuilder: Failed autobuilding of package -> Aborting with an error