CC [M] /usr/src/modules/zaptel/vzaphfc/vzaphfc_main.o /usr/src/modules/zaptel/vzaphfc/vzaphfc_main.c:24:26: error: linux/config.h: Could not find file or directory /usr/src/modules/zaptel/vzaphfc/vzaphfc_main.c: In function âhfc_probeâ: /usr/src/modules/zaptel/vzaphfc/vzaphfc_main.c:1684: warning: passing argument 2 of ârequest_irqâ from incompatible pointer type make[5]: *** [/usr/src/modules/zaptel/vzaphfc/vzaphfc_main.o] Error 1 make[4]: *** [/usr/src/modules/zaptel/vzaphfc] Error 2 make[3]: *** [_module_/usr/src/modules/zaptel] Error 2 make[3]: se sale del directorio `/usr/src/linux-2.6.20.7' make[2]: *** [linux26] Error 2 make[2]: se sale del directorio `/usr/src/modules/zaptel' make[1]: *** [binary-modules] Error 2 make[1]: se sale del directorio `/usr/src/modules/zaptel' make: *** [kdist_build] Error 2 BUILD FAILED! See /var/cache/modass/zaptel-source.buildlog.2.6.20.7.1176726228 for details. Build failed. Press Return to continue...