reqinfo.cpp:98: error: r was not declared in this scope reqinfo.cpp:98: error: expected primary-expression before * token reqinfo.cpp:98: error: cfg was not declared in this scope reqinfo.cpp:98: error: expected primary-expression before * token reqinfo.cpp:98: error: dirCfg was not declared in this scope reqinfo.cpp:98: error: initializer expression list treated as compound expression reqinfo.cpp:99: error: expected , or ; before { token make: *** [obj/Debug/reqinfo.o] Error 1