/home/mrdocs/cvs/135/Scribus/scribus/pageitem_textframe.cpp: In member function ‘virtual void PageItem_TextFrame::layout()’: /home/mrdocs/cvs/135/Scribus/scribus/pageitem_textframe.cpp:1421: error: ‘curent’ was not declared in this scope /home/mrdocs/cvs/135/Scribus/scribus/pageitem_textframe.cpp: At global scope: /home/mrdocs/cvs/135/Scribus/scribus/pageitem_textframe.cpp:230: warning: ‘void layoutDropCap(GlyphLayout, double, double, double, double, double)’ defined but not used make[2]: *** [scribus/CMakeFiles/scribus.dir/pageitem_textframe.o] Error 1 make[1]: *** [scribus/CMakeFiles/scribus.dir/all] Error 2 make: *** [all] Error 2