./../CollectionStore/Collection.cs(32,1): warning CS0105: The using directive for `System.Security.Cryptography' appeared previously in this namespace ./../CollectionStore/Store.cs(32,1): warning CS0105: The using directive for `System.Text' appeared previously in this namespace ./../CollectionStore/Store.cs(1753,1): error CS1002: Expecting `;' ./../CollectionStore/Store.cs(1756,1): error CS1002: Expecting `;' ./../CollectionStore/Store.cs(1758,11): error CS0128: A local variable named `hashedObject' is already defined in this scope ./../CollectionStore/Store.cs(1755,11): (Location of the symbol related to previous error) ./../CollectionStore/Store.cs(1759,1): error CS1002: Expecting `;' Compilation failed: 4 error(s), 2 warnings