make install Making install in . make[1]: Entering directory `/root/Desktop/libdnsres-0.1a' /bin/sh ./libtool --mode=compile gcc -DHAVE_CONFIG_H -I. -I. -I. -I./compat -I/usr/local/include -Wall -O0 -g -DRESOLVSORT -c -o res_comp.lo res_comp.c gcc -DHAVE_CONFIG_H -I. -I. -I. -I./compat -I/usr/local/include -Wall -O0 -g -DRESOLVSORT -c res_comp.c -fPIC -DPIC -o .libs/res_comp.o In file included from res_comp.c:69: /usr/local/include/event.h:302: error: syntax error before 'u_int8_t' /usr/local/include/event.h:305: error: syntax error before 'u_int32_t' /usr/local/include/event.h:307: error: syntax error before 'u_int8_t' /usr/local/include/event.h:310: error: syntax error before 'u_int8_t' /usr/local/include/event.h:313: error: syntax error before 'u_int8_t' /usr/local/include/event.h:318: error: syntax error before 'u_int8_t' /usr/local/include/event.h:320: error: syntax error before 'u_int8_t' /usr/local/include/event.h:321: error: syntax error before 'u_int32_t' /usr/local/include/event.h:322: error: syntax error before 'u_int32_t' /usr/local/include/event.h:325: error: syntax error before 'u_int8_t' /usr/local/include/event.h:328: error: syntax error before 'u_int8_t' /usr/local/include/event.h:331: error: syntax error before 'u_int8_t' /usr/local/include/event.h:334: error: syntax error before 'u_int8_t' In file included from res_comp.c:70: ./netdb.h:74: warning: ignoring #pragma ident In file included from res_comp.c:71: resolv.h:344: warning: '__bounded__' attribute directive ignored make[1]: *** [res_comp.lo] Error 1 make[1]: Leaving directory `/root/Desktop/libdnsres-0.1a' make: *** [install-recursive] Error 1