TARGET_CPU_DEFAULT="" \ HEADERS="ansidecl.h" DEFINES="" \ /bin/sh /var/tmp/portage/gcc-3.4.5/work/gcc-3.4.5/gcc/mkconfig.sh tconfig.h ./xgcc -B./ -B/usr/i686-pc-linux-gnu/bin/ -isystem /usr/i686-pc-linux-gnu/includ e -isystem /usr/i686-pc-linux-gnu/sys-include -L/var/tmp/portage/gcc-3.4.5/work/ build/gcc/../ld -fno-stack-protector -O2 -DIN_GCC -W -Wall -Wwrite-strings -W strict-prototypes -Wmissing-prototypes -Wold-style-definition -isystem ./includ e -I. -I. -I/var/tmp/portage/gcc-3.4.5/work/gcc-3.4.5/gcc -I/var/tmp/portage/gc c-3.4.5/work/gcc-3.4.5/gcc/. -I/var/tmp/portage/gcc-3.4.5/work/gcc-3.4.5/gcc/../ include -g0 -finhibit-size-directive -fno-inline-functions -fno-exceptions -fn o-zero-initialized-in-bss -fno-unit-at-a-time -fno-omit-frame-pointer \ -c /var/tmp/portage/gcc-3.4.5/work/gcc-3.4.5/gcc/crtstuff.c -DCRT_BEGIN \ -o crtbegin.o /var/tmp/portage/gcc-3.4.5/temp/ccqP6Unc.s: Assembler messages: /var/tmp/portage/gcc-3.4.5/temp/ccqP6Unc.s:33: Error: suffix or operands invalid for `push' /var/tmp/portage/gcc-3.4.5/temp/ccqP6Unc.s:43: Error: suffix or operands invalid for `call' /var/tmp/portage/gcc-3.4.5/temp/ccqP6Unc.s:61: Error: suffix or operands invalid for `push' make[2]: *** [crtbegin.o] Error 1 make[2]: Leaving directory `/var/tmp/portage/gcc-3.4.5/work/build/gcc' make[1]: *** [stage1_build] Error 2 make[1]: Leaving directory `/var/tmp/portage/gcc-3.4.5/work/build/gcc' make: *** [profiledbootstrap] Error 2