Making install in include make[1]: Entering directory `/home/jcox/bzflag/include' make[2]: Entering directory `/home/jcox/bzflag/include' make[2]: Nothing to be done for `install-exec-am'. make[2]: Nothing to be done for `install-data-am'. make[2]: Leaving directory `/home/jcox/bzflag/include' make[1]: Leaving directory `/home/jcox/bzflag/include' Making install in data make[1]: Entering directory `/home/jcox/bzflag/data' Making install in l10n make[2]: Entering directory `/home/jcox/bzflag/data/l10n' make[3]: Entering directory `/home/jcox/bzflag/data/l10n' make[3]: Nothing to be done for `install-exec-am'. test -z "/usr/local/share/bzflag/l10n" || "/usr/local/share/bzflag/l10n" /bin/bash: /usr/local/share/bzflag/l10n: is a directory make[3]: *** [install-l10nDATA] Error 126 make[3]: Leaving directory `/home/jcox/bzflag/data/l10n' make[2]: *** [install-am] Error 2 make[2]: Leaving directory `/home/jcox/bzflag/data/l10n' make[1]: *** [install-recursive] Error 1 make[1]: Leaving directory `/home/jcox/bzflag/data' make: *** [install-recursive] Error 1