oat -D__KERNEL__ -DTEXT_BASE=0x33F80000 -I/opt/moko/build/tmp/work/armv4t-linux/uboot-gta01-1.2.0+svnnow-r7_a7676ea7732f3c596805079fed7e5c9fac652cfc_0_1961/git/include -fno-builtin -ffreestanding -nostdinc -isystem /opt/moko/build/tmp/cross/lib/gcc/arm-linux/4.1.1/include -pipe -DCONFIG_ARM -D__ARM__ -march=armv4 -mabi=apcs-gnu -Wall -Wstrict-prototypes -c -o cmd_mfsl.o cmd_mfsl.c | cmd_mfsl.c:32:21: error: asm/asm.h: No such file or directory | make[2]: *** [cmd_mfsl.o] Error 1 | make[2]: Leaving directory `/opt/moko/build/tmp/work/armv4t-linux/uboot-gta01-1.2.0+svnnow-r7_a7676ea7732f3c596805079fed7e5c9fac652cfc_0_1961/git/common' | make[1]: *** [common/libcommon.a] Error 2 | make[1]: Leaving directory `/opt/moko/build/tmp/work/armv4t-linux/uboot-gta01-1.2.0+svnnow-r7_a7676ea7732f3c596805079fed7e5c9fac652cfc_0_1961/git' | FATAL: oe_runmake failed NOTE: Task failed: /opt/moko/build/tmp/work/armv4t-linux/uboot-gta01-1.2.0+svnnow-r7_a7676ea7732f3c596805079fed7e5c9fac652cfc_0_1961/temp/log.do_compile.16594 NOTE: package uboot-gta01-1.2.0+svnnow-r7_a7676ea7732f3c596805079fed7e5c9fac652cfc_0_1961: task do_compile: failed ERROR: TaskFailed event exception, aborting NOTE: package uboot-gta01-1.2.0+svnnow: failed ERROR: Build of openmoko-devel-image failed make: *** [openmoko-devel-image] Error 1