bennyp@Medium-Brain meterbridge-0.9.2 $ make Making all in src make all-am source='main.c' object='main.o' libtool=no \ depfile='.deps/main.Po' tmpdepfile='.deps/main.TPo' \ depmode=gcc3 /bin/sh ../depcomp \ gcc -DHAVE_CONFIG_H -I. -I. -I. -Wall -g -I/sw/include/SDL -D_THREAD_SAFE -I/usr/local/include -DPKG_DATA_DIR=\"/usr/local/share/meterbridge\" -c `test -f 'main.c' || echo './'`main.c source='linedraw.c' object='linedraw.o' libtool=no \ depfile='.deps/linedraw.Po' tmpdepfile='.deps/linedraw.TPo' \ depmode=gcc3 /bin/sh ../depcomp \ gcc -DHAVE_CONFIG_H -I. -I. -I. -Wall -g -I/sw/include/SDL -D_THREAD_SAFE -I/usr/local/include -DPKG_DATA_DIR=\"/usr/local/share/meterbridge\" -c `test -f 'linedraw.c' || echo './'`linedraw.c source='vu_meters.c' object='vu_meters.o' libtool=no \ depfile='.deps/vu_meters.Po' tmpdepfile='.deps/vu_meters.TPo' \ depmode=gcc3 /bin/sh ../depcomp \ gcc -DHAVE_CONFIG_H -I. -I. -I. -Wall -g -I/sw/include/SDL -D_THREAD_SAFE -I/usr/local/include -DPKG_DATA_DIR=\"/usr/local/share/meterbridge\" -c `test -f 'vu_meters.c' || echo './'`vu_meters.c vu_meters.c:11: error: static declaration of 'buf_rect' follows non-static declaration main.h:11: error: previous declaration of 'buf_rect' was here make[2]: *** [vu_meters.o] Error 1 make[1]: *** [all] Error 2 make: *** [all-recursive] Error 1