[max@localhost oe_home]$ bitbake bootstrap-image NOTE: Using cache in '/home/max/oe_home/tmp/cache' NOTE: Parsing finished. 3197 cached, 0 parsed, 65 skipped, 0 masked. NOTE: multiple providers are available (glibc, glibc-intermediate); NOTE: consider defining PREFERRED_PROVIDER_virtual/arm-linux-libc-for-gcc NOTE: ERROR: Error Method already seen: get_glibc_fpu_setting in' glibc_2.3.5+cvs20050627.bb' now in 'glibc-package.bbclass' ERROR: Error Method already seen: get_gcc_fpu_setting in' gcc3-build.inc' now in 'gcc_3.3.4.bb' NOTE: package mtd-utils-native-20060223: started NOTE: package mtd-utils-native-20060223-r0: task do_fetch: started NOTE: package mtd-utils-native-20060223-r0: task do_fetch: completed NOTE: package mtd-utils-native-20060223-r0: task do_patch: started NOTE: Applying patch 'add-exclusion-to-mkfs-jffs2-20060131.patch' ERROR: function do_patchcmd failed ERROR: log data follows (/home/max/oe_home/tmp/work/mtd-utils-native-20060223-r0/temp/log.do_patchcmd.10269) | Replacing patch add-exclusion-to-mkfs-jffs2-20060131.patch with new version | Applying patch add-exclusion-to-mkfs-jffs2-20060131.patch | patching file util/mkfs.jffs2.c | Hunk #3 succeeded at 381 with fuzz 1. | Hunk #4 succeeded at 1161 (offset -10 lines). | Hunk #5 FAILED at 1204. | Hunk #6 FAILED at 1374. | Hunk #7 succeeded at 1403 (offset -9 lines). | 2 out of 7 hunks FAILED -- rejects in file util/mkfs.jffs2.c | Patch add-exclusion-to-mkfs-jffs2-20060131.patch does not apply (enforce with -f) NOTE: Task failed: /home/max/oe_home/tmp/work/mtd-utils-native-20060223-r0/temp/log.do_patchcmd.10269 NOTE: package mtd-utils-native-20060223-r0: task do_patch: failed ERROR: TaskFailed event exception, aborting NOTE: package mtd-utils-native-20060223: failed ERROR: Build of bootstrap-image failed