ioset.c:44: error: static declaration of âclock_skewâ follows non-static declaration ioset.h:47: error: previous declaration of âclock_skewâ was here ioset.c: In function âioset_runâ: ioset.c:410: warning: pointer targets in passing argument 5 of âgetsockoptâ differ in signedness make[2]: *** [ioset.o] Error 1 make[2]: Leaving directory `/home/ircd/srvx-1.3/src' make[1]: *** [all] Error 2 make[1]: Leaving directory `/home/ircd/srvx-1.3/src' make: *** [all-recursive] Error 1