AR arch/mips/lib/lib.a CC arch/mips/lib-32/dump_tlb.o LD arch/mips/lib-32/built-in.o AS arch/mips/lib-32/csum_partial.o AS arch/mips/lib-32/memset.o AS arch/mips/lib-32/watch.o AR arch/mips/lib-32/lib.a GEN .version CHK include/linux/compile.h UPD include/linux/compile.h CC init/version.o LD init/built-in.o LD .tmp_vmlinux1 mipsel-linux-uclibc-ld:arch/mips/kernel/vmlinux.lds:37: syntax error make[5]: *** [.tmp_vmlinux1] Error 1 make[5]: Leaving directory `/home/ubuntu/kamikaze_ar7/build_mipsel/linux-2.6-ar7/linux-2.6.19.2' make[4]: *** [/home/ubuntu/kamikaze_ar7/build_mipsel/linux-2.6-ar7/linux-2.6.19.2/.image] Error 2 make[4]: Leaving directory `/home/ubuntu/kamikaze_ar7/target/linux/ar7-2.6' make[3]: *** [install] Error 2 make[3]: Leaving directory `/home/ubuntu/kamikaze_ar7/target/linux'