geek@laptop:~/RT61_Linux_STA_Drv1.1.0.0/Module$ make allmake -C /lib/modules/2.6.20-15-generic/build SUBDIRS=/home/geek/RT61_Linux_STA_Drv1.1.0.0/Module modules make[1]: Entering directory `/usr/src/linux-headers-2.6.20-15-generic' CC [M] /home/geek/RT61_Linux_STA_Drv1.1.0.0/Module/rtmp_main.o /home/geek/RT61_Linux_STA_Drv1.1.0.0/Module/rtmp_main.c: In function ‘RT61_probe’: /home/geek/RT61_Linux_STA_Drv1.1.0.0/Module/rtmp_main.c:197: error: ‘struct net_device’ has no member named ‘get_wireless_stats’ /home/geek/RT61_Linux_STA_Drv1.1.0.0/Module/rtmp_main.c: In function ‘RT61_open’: /home/geek/RT61_Linux_STA_Drv1.1.0.0/Module/rtmp_main.c:326: warning: passing argument 2 of ‘request_irq’ from incompatible pointer type make[2]: *** [/home/geek/RT61_Linux_STA_Drv1.1.0.0/Module/rtmp_main.o] Error 1 make[1]: *** [_module_/home/geek/RT61_Linux_STA_Drv1.1.0.0/Module] Error 2 make[1]: Leaving directory `/usr/src/linux-headers-2.6.20-15-generic' make: *** [all] Error 2