gcc -DHAVE_CONFIG_H -I. -I. -I.. -Wall -I/usr/include -I/usr/include/gtk-2.0 -I/usr/lib/gtk-2.0/include -I/usr/include/atk-1.0 -I/usr/include/cairo -I/usr/include/pango-1.0 -I/usr/include/glib-2.0 -I/usr/lib/glib-2.0/include -I.. -g -O2 -I/usr/include -MT libexpense_la-expense.lo -MD -MP -MF .deps/libexpense_la-expense.Tpo -c expense.c -fPIC -DPIC -o .libs/libexpense_la-expense.o In file included from expense.c:38: ../utils.h:484: error: expected declaration specifiers or '...' before 'pi_uid_t' ../utils.h:491: error: expected declaration specifiers or '...' before 'pi_uid_t' ../utils.h:508: error: expected declaration specifiers or '...' before 'pi_uid_t' expense.c: In function 'cb_edit_cats': expense.c:1118: warning: pointer targets in passing argument 3 of 'pi_file_get_app_info' differ in signedness make[2]: *** [libexpense_la-expense.lo] Error 1 make[2]: Leaving directory `/storage/can2/jpilot/Expense' make[1]: *** [all-recursive] Error 1 make[1]: Leaving directory `/storage/can2/jpilot' make: *** [all] Error 2