Dear Alex Karpov! The audacity-1.3.3-alt0.1 package has been rejected from incoming for i586 architecture. Possible reason follows: generic/FileDialogPrivate.cpp:315: error: 'm_filePath' was not declared in this scope generic/FileDialogPrivate.cpp:318: error: 'IsDir' was not declared in this scope generic/FileDialogPrivate.cpp:320: error: 'IsLink' was not declared in this scope generic/FileDialogPrivate.cpp:322: error: 'IsDrive' was not declared in this scope generic/FileDialogPrivate.cpp:325: error: 'm_size' was not declared in this scope generic/FileDialogPrivate.cpp:329: error: 'IsDrive' was not declared in this scope generic/FileDialogPrivate.cpp:333: error: 'm_permissions' was not declared in this scope generic/FileDialogPrivate.cpp: At global scope: generic/FileDialogPrivate.cpp:339: error: 'FileData' is not a class or namespace generic/FileDialogPrivate.cpp:339: error: 'fileListFieldType' was not declared in this scope generic/FileDialogPrivate.cpp:339: error: expected ',' or ';' before 'const' generic/FileDialogPrivate.cpp:86: warning: 'int FileDataNameCompare(long int, long int, long int)' defined but not used generic/FileDialogPrivate.cpp:98: warning: 'int FileDataSizeCompare(long int, long int, long int)' defined but not used generic/FileDialogPrivate.cpp:112: warning: 'int FileDataTypeCompare(long int, long int, long int)' defined but not used generic/FileDialogPrivate.cpp:126: warning: 'int FileDataTimeCompare(long int, long int, long int)' defined but not used make[2]: *** [generic/FileDialogPrivate.o] Error 1 make[2]: Leaving directory `/usr/src/RPM/BUILD/audacity-src-1.3.3-beta/lib-src/FileDialog' make[1]: *** [FileDialog-recursive] Error 2 make[1]: Leaving directory `/usr/src/RPM/BUILD/audacity-src-1.3.3-beta/lib-src' make: *** [audacity] Error 2 make: Leaving directory `/usr/src/RPM/BUILD/audacity-src-1.3.3-beta' error: Bad exit status from /usr/src/tmp/rpm-tmp.90326 (%build)