-bash-3.1$ gmake Generating ksharedpixmap.moc Scanning dependencies of target kdeui Building CXX object kdeui/CMakeFiles/kdeui.dir/ksharedpixmap.o /home/kde4/kdelibs4_snapshot/kdeui/ksharedpixmap.cpp: In member function ` virtual bool KSharedPixmap::x11Event(XEvent*)': /home/kde4/kdelibs4_snapshot/kdeui/ksharedpixmap.cpp:179: error: no matching function for call to `KPixmap::KPixmap(unsigned int&, unsigned int&)' /home/kde4/kdelibs4_snapshot/kdeui/ksharedpixmap.cpp:107: error: candidates are: KPixmap::KPixmap(const KPixmap&) /usr/pkg/include/kpixmap.h:93: error: KPixmap::KPixmap(const QPixmap&) /usr/pkg/include/kpixmap.h:82: error: KPixmap::KPixmap() /home/kde4/kdelibs4_snapshot/kdeui/ksharedpixmap.cpp:216: error: no matching function for call to `KPixmap::KPixmap(unsigned int, unsigned int)' /home/kde4/kdelibs4_snapshot/kdeui/ksharedpixmap.cpp:107: error: candidates are: KPixmap::KPixmap(const KPixmap&) /usr/pkg/include/kpixmap.h:93: error: KPixmap::KPixmap(const QPixmap&) /usr/pkg/include/kpixmap.h:82: error: KPixmap::KPixmap() gmake[2]: *** [kdeui/CMakeFiles/kdeui.dir/ksharedpixmap.o] Error 1 gmake[1]: *** [kdeui/CMakeFiles/kdeui.dir/all] Error 2 gmake: *** [all] Error 2