make targets BUILDDIR=release CFLAGS=" -Dstricmp=strcasecmp -D_stricmp=strcasecmp -I/usr/X11R6/include -O3 -funroll-loops -fomit-frame-pointer -ftree-vectorize -fexpensive-optimizations -march=i686" make[1]: Entering directory `/home/gruetamer/.codered' cc -Dstricmp=strcasecmp -D_stricmp=strcasecmp -I/usr/X11R6/include -O3 -funroll-loops -fomit-frame-pointer -ftree-vectorize -fexpensive-optimizations -march=i686 -fPIC -o release/game/acebot_ai.o -c source//game/acesrc/acebot_ai.c In file included from source//game/acesrc/../g_local.h:22, from source//game/acesrc/acebot_ai.c:64: source//game/acesrc/../q_shared.h:34:20: error: assert.h: No such file or directory source//game/acesrc/../q_shared.h:35:18: error: math.h: No such file or directory source//game/acesrc/../q_shared.h:36:19: error: stdio.h: No such file or directory source//game/acesrc/../q_shared.h:38:20: error: string.h: No such file or directory source//game/acesrc/../q_shared.h:39:20: error: stdlib.h: No such file or directory source//game/acesrc/../q_shared.h:40:18: error: time.h: No such file or directory In file included from source//game/acesrc/acebot_ai.c:64: source//game/acesrc/../g_local.h:836: error: expected declaration specifiers or ‘...’ before ‘FILE’ source//game/acesrc/acebot_ai.c: In function ‘ACEAI_Think’: source//game/acesrc/acebot_ai.c:79: warning: incompatible implicit declaration of built-in function ‘memset’ source//game/acesrc/acebot_ai.c:130: warning: incompatible implicit declaration of built-in function ‘floor’ make[1]: *** [release/game/acebot_ai.o] Error 1 make[1]: Leaving directory `/home/gruetamer/.codered' make: *** [build-release] Error 2