| Making IPC::SysV (dynamic) | Checking if your kit is complete... | Looks good | Writing Makefile for IPC::SysV | make[1]: Entering directory `/zaurus/build/tmp/work/i686-linux/perl-native-5.8.8-r12/perl-5.8.8/ext/IPC/SysV' | make[1]: Leaving directory `/zaurus/build/tmp/work/i686-linux/perl-native-5.8.8-r12/perl-5.8.8/ext/IPC/SysV' | make[1]: Entering directory `/zaurus/build/tmp/work/i686-linux/perl-native-5.8.8-r12/perl-5.8.8/ext/IPC/SysV' | cp Msg.pm ../../../lib/IPC/Msg.pm | cp Semaphore.pm ../../../lib/IPC/Semaphore.pm | cp SysV.pm ../../../lib/IPC/SysV.pm | ../../../miniperl "-I../../../lib" "-I../../../lib" ../../../lib/ExtUtils/xsubpp -typemap ../../../lib/ExtUtils/typemap SysV.xs > SysV.xsc && mv SysV.xsc SysV.c | ccache gcc -c -D_REENTRANT -D_GNU_SOURCE -DTHREADS_HAVE_PIDS -fno-strict-aliasing -pipe -Wdeclaration-after-statement -D_LARGEFILE_SOURCE -D_FILE_OFFSET_BITS=64 -O2 -DVERSION=\"1.04\" -DXS_VERSION=\"1.04\" -fpic "-I../../.." SysV.c | SysV.xs:7:25: error: asm/page.h: No such file or directory | make[1]: *** [SysV.o] Error 1 | make[1]: Leaving directory `/zaurus/build/tmp/work/i686-linux/perl-native-5.8.8-r12/perl-5.8.8/ext/IPC/SysV' | make: *** [lib/auto/IPC/SysV/SysV.so] Error 2 | FATAL: oe_runmake failed NOTE: Task failed: /zaurus/build/tmp/work/i686-linux/perl-native-5.8.8-r12/temp/log.do_compile.27725 NOTE: package perl-native-5.8.8-r12: task do_compile: failed ERROR: TaskFailed event exception, aborting NOTE: package perl-native-5.8.8: failed ERROR: Build of /zaurus/org.openembedded.dev/packages/perl/perl-native_5.8.8.bb do_compile failed ERROR: Task 1257 (/zaurus/org.openembedded.dev/packages/perl/perl-native_5.8.8.bb, do_compile) failed ERROR: '/zaurus/org.openembedded.dev/packages/perl/perl-native_5.8.8.bb' failed