Building file: ../TextUtils.cxx Invoking: GCC C++ Compiler g++ -I/usr/include/ -O0 -g3 -Wall -c -fmessage-length=0 -MMD -MP -MF"TextUtils.d" -MT"TextUtils.d" -o"TextUtils.o" "../TextUtils.cxx" ../TextUtils.cxx: In function ‘bool TextUtils::parseDuration(const char*, int&)’: ../TextUtils.cxx:211: error: ‘regex_t’ was not declared in this scope ../TextUtils.cxx:211: error: expected `;' before ‘preg’ ../TextUtils.cxx:212: error: ‘preg’ was not declared in this scope ../TextUtils.cxx:213: error: ‘REG_ICASE’ was not declared in this scope ../TextUtils.cxx:213: error: ‘REG_NOSUB’ was not declared in this scope ../TextUtils.cxx:213: error: ‘REG_EXTENDED’ was not declared in this scope ../TextUtils.cxx:213: error: ‘regcomp’ was not declared in this scope ../TextUtils.cxx:214: error: ‘regexec’ was not declared in this scope ../TextUtils.cxx:215: error: ‘regfree’ was not declared in this scope ../TextUtils.cxx:216: error: ‘REG_NOMATCH’ was not declared in this scope make: *** [TextUtils.o] Error 1 make: Target `all' not remade because of errors. Build complete for project bzworkbench