bash-3.00# make gcc -pipe -c -O -fPIC -DUSE_TCL_STUBS -DUSE_TK_STUBS -DALSA -I/usr/X11R6/include -I/usr/include -I/tmp/tcl8.4.11/generic -I/tmp/tk8.4.11/generic -DTCL_81_API -I./../generic -DPACKAGE_NAME=\"\" -DPACKAGE_TARNAME=\"\" -DPACKAGE_VERSION=\"\" -DPACKAGE_STRING=\"\" -DPACKAGE_BUGREPORT=\"\" -DSTDC_HEADERS=1 -DHAVE_SYS_TYPE S_H=1 -DHAVE_SYS_STAT_H=1 -DHAVE_STDLIB_H=1 -DHAVE_STRING_H=1 -DHAVE_MEMORY_H=1 -DHAVE_STRINGS_H=1 -DHAVE_INTTYPES_H=1 -DHAVE_STDINT_H=1 -DHAVE_UNISTD_H=1 ./.. /generic/sound.c In file included from ../generic/snack.h:34, from ../generic/sound.c:24: ../generic/jkAudIO.h:105:28: alsa/asoundlib.h: No such file or directory In file included from ../generic/snack.h:34, from ../generic/sound.c:24: ../generic/jkAudIO.h:132: error: syntax error before "snd_pcm_t" ../generic/jkAudIO.h:132: warning: no semicolon at end of struct or union ../generic/jkAudIO.h:216: error: syntax error before '}' token ../generic/jkAudIO.h:216: warning: data definition has no type or storage class ../generic/jkAudIO.h:224: error: syntax error before '*' token ../generic/jkAudIO.h:227: error: syntax error before '*' token ../generic/jkAudIO.h:228: error: syntax error before '*' token ../generic/jkAudIO.h:229: error: syntax error before '*' token ../generic/jkAudIO.h:230: error: syntax error before '*' token ../generic/jkAudIO.h:231: error: syntax error before '*' token ../generic/jkAudIO.h:232: error: syntax error before '*' token ../generic/jkAudIO.h:233: error: syntax error before '*' token ../generic/jkAudIO.h:234: error: syntax error before '*' token ../generic/jkAudIO.h:235: error: syntax error before '*' token ../generic/jkAudIO.h:236: error: syntax error before '*' token make: *** [sound.o] Error 1