Compiler: Default compiler Building Makefile: "C:\pawn\plugin\mysql\Makefile.win" Executing make... make.exe -f "C:\pawn\plugin\mysql\Makefile.win" all g++.exe -c core.c -o core.o -I"C:/Dev-Cpp/lib/gcc/mingw32/3.4.2/include" -I"C:/Dev-Cpp/include/c++/3.4.2/backward" -I"C:/Dev-Cpp/include/c++/3.4.2/mingw32" -I"C:/Dev-Cpp/include/c++/3.4.2" -I"C:/Dev-Cpp/include" -DBUILDING_DLL=1 In file included from C:/Dev-Cpp/include/mysql/mysql.h:57, from core.c:2: C:/Dev-Cpp/include/mysql/mysql_com.h:175: error: `SOCKET' does not name a type C:/Dev-Cpp/include/mysql/mysql_com.h:339: error: `SOCKET' was not declared in this scope C:/Dev-Cpp/include/mysql/mysql_com.h:339: error: expected primary-expression before "const" C:/Dev-Cpp/include/mysql/mysql_com.h:339: error: expected primary-expression before "unsigned" C:/Dev-Cpp/include/mysql/mysql_com.h:340: error: expected primary-expression before "unsigned" C:/Dev-Cpp/include/mysql/mysql_com.h:340: error: initializer expression list treated as compound expression core.c: In function `char* get_string_from_mysql(char*)': core.c:47: error: `strcpy' undeclared (first use this function) core.c:47: error: (Each undeclared identifier is reported only once for each function it appears in.) core.c: In function `char* process_string_for_mysql(char*)': core.c:67: error: `strlen' undeclared (first use this function) core.c:68: error: `memset' undeclared (first use this function) make.exe: *** [core.o] Error 1 Execution terminated