if /bin/sh ../libtool --tag=CC --mode=compile gcc -DHAVE_CONFIG_H -I. -I. -I../include -I../corelib -I../include -DZAPATA_PRI -g -O2 -MT chan_zap_la-chan_zap.lo -MD -MP -MF ".deps/chan_zap_la-chan_zap.Tpo" -c -o chan_zap_la-chan_zap.lo `test -f 'chan_zap.c' || echo './'`chan_zap.c; \ then mv -f ".deps/chan_zap_la-chan_zap.Tpo" ".deps/chan_zap_la-chan_zap.Plo"; else rm -f ".deps/chan_zap_la-chan_zap.Tpo"; exit 1; fi gcc -DHAVE_CONFIG_H -I. -I. -I../include -I../corelib -I../include -DZAPATA_PRI -g -O2 -MT chan_zap_la-chan_zap.lo -MD -MP -MF .deps/chan_zap_la-chan_zap.Tpo -c chan_zap.c -fPIC -DPIC -o .libs/chan_zap_la-chan_zap.o chan_zap.c: In function 'ss_thread': chan_zap.c:5903: warning: pointer targets in passing argument 2 of 'adsi_rx' differ in signedness chan_zap.c:5904: warning: pointer targets in passing argument 2 of 'adsi_rx' differ in signedness chan_zap.c: In function 'do_monitor': chan_zap.c:6286: error: 'struct ' has no member named 'bit_pos' chan_zap.c:6417: error: 'struct ' has no member named 'bit_pos' make[2]: *** [chan_zap_la-chan_zap.lo] Error 1 make[2]: Leaving directory `/home/cstomi/callweaver/trunk/channels' make[1]: *** [all-recursive] Error 1 make[1]: Leaving directory `/home/cstomi/callweaver/trunk/channels' make: *** [all-recursive] Error 1