ccache g++ -c -pipe -march=c3 -I/usr/include/kde/artsc -pthread -I/usr/include/glib-2.0 -I/usr/lib/glib-2.0/include -Wall -W -g -D_REENTRANT -DPIC -fPIC -DMMX -Di386 -D_GNU_SOURCE -D_FILE_OFFSET_BITS=64 -DPREFIX=\"/usr\" -DLIBDIR=\"/usr/lib\" -DUSE_JOYSTICK_MENU -DUSE_LIRC -DQT_THREAD_SUPPORT -DQT_SHARED -DQT_NO_DEBUG -I/usr/share/qt3/mkspecs/default -I. -I/usr/include -I/usr/include -I/usr/X11R6/include -I../libmyth -I../.. -I.. -I/usr/include/qt3 -o mythimage.o mythimage.cpp mythimage.cpp: In static member function `static void MythImage::MakeGradient(QImage&, const QColor&, const QColor&, int)': mythimage.cpp:107: error: `uint32_t' undeclared (first use this function) mythimage.cpp:107: error: (Each undeclared identifier is reported only once for each function it appears in.) mythimage.cpp:107: error: parse error before `=' token mythimage.cpp:109: error: `ptr' undeclared (first use this function) mythimage.cpp:109: error: parse error before `)' token mythimage.cpp:111: error: `black' undeclared (first use this function) mythimage.cpp:118: error: 'class MythImage' has no member named 'uint32_t' mythimage.cpp:118: error: parse error before `=' token mythimage.cpp:119: error: parse error before `)' token mythimage.cpp:115: warning: unused variable `int r' mythimage.cpp:116: warning: unused variable `int g' mythimage.cpp:117: warning: unused variable `int b' mythimage.cpp:127: error: parse error before `)' token make[2]: *** [mythimage.o] Error 1 make[2]: Leaving directory `/myth/build/mythtv-HEAD/libs/libmythui' make[1]: *** [sub-libmythui] Error 2 make[1]: Leaving directory `/myth/build/mythtv-HEAD/libs' make: *** [sub-libs] Error 2