In file included from /usr/include/python2.4/Python.h:13, from src/pygame.h:57, from src/display.c:27: /usr/include/python2.4/pyconfig.h:826:1: warning: "_GNU_SOURCE" redefined :1:1: warning: this is the location of the previous definition src/display.c: In function 'get_wm_info': src/display.c:388: error: 'SDL_SysWMinfo' has no member named 'info' src/display.c:389: error: 'SDL_SysWMinfo' has no member named 'info' src/display.c:390: error: 'SDL_SysWMinfo' has no member named 'info' src/display.c:391: error: 'SDL_SysWMinfo' has no member named 'info' src/display.c:392: error: 'SDL_SysWMinfo' has no member named 'info' src/display.c:393: error: 'SDL_SysWMinfo' has no member named 'info' error: command 'i686-pc-linux-gnu-gcc' failed with exit status 1 !!! ERROR: dev-python/pygame-1.6.2 failed. Call stack: ebuild.sh, line 1614: Called dyn_compile ebuild.sh, line 971: Called qa_call 'src_compile' environment, line 3326: Called src_compile ebuild.sh, line 1304: Called distutils_src_compile distutils.eclass, line 38: Called die !!! compilation failed !!! If you need support, post the topmost build error, and the call stack if relevant. !!! A complete build log is located at '/var/tmp/portage/dev-python/pygame-1.6.2/temp/build.log'.