Compiling ==> 'v_network.c' ===== extern\verse\dist\v_network.c: In function `v_n_receive_data': extern\verse\dist\v_network.c:212: error: `socklen_t' undeclared (first use in this function) extern\verse\dist\v_network.c:212: error: (Each undeclared identifier is reported only once extern\verse\dist\v_network.c:212: error: for each function it appears in.) extern\verse\dist\v_network.c:212: error: syntax error before "from_length" extern\verse\dist\v_network.c:221: error: `from_length' undeclared (first use in this function) ===== scons: *** [C:\blender\build_dir\extern\verse\dist\v_network.o] Error 1 scons: building terminated because of errors.