lex.yy.c:9174: error: syntax error before numeric constant lex.yy.c: In function `yy_scan_string': lex.yy.c:9175: error: number of arguments doesn't match prototype lex.yy.c:367: error: prototype declaration lex.yy.c:9177: warning: passing arg 1 of `strlen' makes pointer from integer without a cast lex.yy.c:9177: warning: passing arg 1 of `yy_scan_bytes' makes pointer from integer without a cast ./parser.l: At top level: lex.yy.c:8687: warning: 'yyunput' defined but not used lex.yy.c:9266: warning: 'yy_top_state' defined but not used make[2]: *** [lex.yy.o] Error 1 make[2]: Leaving directory `/var/tmp/portage/wine-0.9.4/work/wine-0.9.4/tools/wrc' make[1]: *** [wrc] Error 2 make[1]: Leaving directory `/var/tmp/portage/wine-0.9.4/work/wine-0.9.4/tools' make: *** [tools] Error 2 !!! ERROR: app-emulation/wine-0.9.4 failed. !!! Function src_compile, Line 138, Exitcode 2 !!! depend !!! If you need support, post the topmost build error, NOT this status message.