In file included from /usr/include/dbus-1.0/dbus/dbus-glib.h:137, from manager.c:46: /usr/include/dbus-1.0/dbus/dbus-gtype-specialized.h:169: warning: redundant redeclaration of 'dbus_g_type_map_peek_vtable' /usr/include/dbus-1.0/dbus/dbus-gtype-specialized.h:162: warning: previous declaration of 'dbus_g_type_map_peek_vtable' was here /usr/include/dbus-1.0/dbus/dbus-gtype-specialized.h:170: warning: redundant redeclaration of 'dbus_g_type_collection_peek_vtable' /usr/include/dbus-1.0/dbus/dbus-gtype-specialized.h:163: warning: previous declaration of 'dbus_g_type_collection_peek_vtable' was here manager.c: In function 'gvm_local_user': manager.c:3214: warning: assignment makes pointer from integer without a cast manager.c:3215: error: 'struct utmp' has no member named 'ut_type' manager.c:3215: error: 'USER_PROCESS' undeclared (first use in this function) manager.c:3215: error: (Each undeclared identifier is reported only once manager.c:3215: error: for each function it appears in.) manager.c:3215: error: 'struct utmp' has no member named 'ut_user' gmake[2]: *** [manager.o] Error 1 gmake[2]: Leaving directory `/var/tmp/portage/gnome-base/gnome-volume-manager-2.17.0/work/gnome-volume-manager-2.17.0/src' gmake[1]: *** [all-recursive] Error 1 gmake[1]: Leaving directory `/var/tmp/portage/gnome-base/gnome-volume-manager-2.17.0/work/gnome-volume-manager-2.17.0' gmake: *** [all] Error 2 !!! ERROR: gnome-base/gnome-volume-manager-2.17.0 failed. Call stack: ebuild.sh, line 1637: Called dyn_compile ebuild.sh, line 983: Called qa_call 'src_compile' ebuild.sh, line 44: Called src_compile ebuild.sh, line 1322: Called gnome2_src_compile gnome2.eclass, line 71: Called die !!! compile failure !!! If you need support, post the topmost build error, and the call stack if relevant. !!! A complete build log is located at '/var/tmp/portage/gnome-base/gnome-volume-manager-2.17.0/temp/build.log'.