t/17fstack..........ok t/18engine..........ok t/20dummy...........ok t/20keepalive.......ok t/22http............NOK 4/5 # Failed test 'Got an answer (302)' # at t/22http.t line 50. # '302' # doesn't match '(?-xism:^5\d\d$)' t/22http............FAILED test 4 Failed 1/5 tests, 80.00% okay t/22transparent.....NOK 5/6 # Failed test 'Got an answer (302)' # at t/22transparent.t line 54. # got: '302' # expected: '500' t/22transparent.....FAILED test 5 Failed 1/6 tests, 83.33% okay t/23connect.........ok t/23https...........skipped all skipped: Can't make this work with Crypt::SSLeay t/40push_filters....ok t/41filters.........ok t/42will_modify.....ok t/50hopbyhop........ok t/50standard........ok t/50via.............ok t/51simple..........ok t/51simple2.........ok t/61simple..........ok t/61simple2.........ok t/64htmltext........ok t/64lines...........ok t/64tags............ok t/66htmlparser......ok t/71rot13...........ok t/90diveintomark....ok Failed Test Stat Wstat Total Fail List of Failed ------------------------------------------------------------------------------- t/22http.t 5 1 4 t/22transparent.t 6 1 5 3 tests skipped. Failed 2/33 test scripts. 2/358 subtests failed. Files=33, Tests=358, 34 wallclock secs (14.05 cusr + 1.15 csys = 15.20 CPU) Failed 2/33 test programs. 2/358 subtests failed. make: *** [test_dynamic] Error 255 /usr/bin/make test -- NOT OK Running make install make test had returned bad status, won't install without force