gtkmodule.c:33:22: error: pycairo.h: No such file or directory gtkmodule.c:34: error: expected '=', ',', ';', 'asm' or '__attribute__' before '*' token gtkmodule.c: In function 'init_pycairo': gtkmodule.c:182: error: 'Pycairo_IMPORT' undeclared (first use in this function) gtkmodule.c:182: error: (Each undeclared identifier is reported only once gtkmodule.c:182: error: for each function it appears in.) gtkmodule.c:183: error: 'Pycairo_CAPI' undeclared (first use in this function) gtkmodule.c: In function 'init_gtk': gtkmodule.c:195: warning: suggest parentheses around && within || make[2]: *** [_gtk_la-gtkmodule.lo] Error 1 make[2]: Leaving directory `/home/zoo/pygtk-2.10/pygtk-2.10.0/gtk' make[1]: *** [all-recursive] Error 1 make[1]: Leaving directory `/home/zoo/pygtk-2.10/pygtk-2.10.0' make: *** [all] Error 2 zoo@aspire-3610:~/pygtk-2.10/pygtk-2.10.0$