# ./build64.sh Wrapper Build System -------------------- Buildfile: build.xml init:msg: ********************************************************************** About to build a 64-bit version of the Java Service Wrapper 3.2.3. The OS Name is "OpenBSD", resolved from "OpenBSD". The Architecture is "x86", resolved from "amd64". The distribution name will be: wrapper-OpenBSD-x86-64-3.2.3 ********************************************************************** update-info: Copying 1 file to /home/Dom/wrapper_3.2.3_src/src/java/org/tanukisoftware/wrappe r Copying 1 file to /home/Dom/wrapper_3.2.3_src/src/c compile-java-warn: ********************************************************************** WARNING The jar is being built for Java version 1.4. This will not be compatible with older JVMs. ********************************************************************** compile-java: Compiling 1 source file to /home/Dom/wrapper_3.2.3_src/build/classes ClassArgument.name=org.tanukisoftware.wrapper.WrapperManager compile-c-unix: if test ! -d .deps; then mkdir .deps; fi gcc -Wall -pedantic -DOpenBSD wrapper.c wrapperinfo.c wrappereventloop.c wrapper_unix.c property.c logger.c -lm -lcompat -pthread -o ../../bin/wrapper wrapper.c:120:23: asm/errno.h: No such file or directory wrapper_unix.c: In function `getSignalCodeDesc': wrapper_unix.c:226: error: `SI_MESGQ' undeclared (first use in this function) wrapper_unix.c:226: error: (Each undeclared identifier is reported only once wrapper_unix.c:226: error: for each function it appears in.) wrapper_unix.c:229: error: `SI_ASYNCIO' undeclared (first use in this function) In file included from property.c:46: /usr/include/malloc.h:4:2: warning: #warning " is obsolete, use " *** Error code 1 Stop in /home/Dom/wrapper_3.2.3_src/src/c (line 27 of Makefile-OpenBSD-x86-64). BUILD FAILED /home/Dom/wrapper_3.2.3_src/build.xml:576: exec returned: 1 Total time: 8 seconds