entrance_session.c:5:37: error: Esmart/Esmart_Container.h: No such file or directory entrance_session.c: In function ‘entrance_session_xsession_list_add’: entrance_session.c:644: warning: implicit declaration of function ‘esmart_container_new’ entrance_session.c:644: warning: assignment makes pointer from integer without a cast entrance_session.c:646: warning: implicit declaration of function ‘esmart_container_padding_set’ entrance_session.c:647: warning: implicit declaration of function ‘esmart_container_spacing_set’ entrance_session.c:648: warning: implicit declaration of function ‘esmart_container_move_button_set’ entrance_session.c:651: warning: implicit declaration of function ‘esmart_container_fill_policy_set’ entrance_session.c:652: error: ‘CONTAINER_FILL_POLICY_KEEP_ASPECT’ undeclared (first use in this function) entrance_session.c:652: error: (Each undeclared identifier is reported only once entrance_session.c:652: error: for each function it appears in.) entrance_session.c:653: warning: implicit declaration of function ‘esmart_container_direction_set’ entrance_session.c:669: warning: implicit declaration of function ‘esmart_container_element_append’ entrance_session.c: In function ‘entrance_session_user_list_add’: entrance_session.c:716: warning: assignment makes pointer from integer without a cast entrance_session.c:724: error: ‘CONTAINER_FILL_POLICY_KEEP_ASPECT’ undeclared (first use in this function) make[3]: *** [entrance_session.o] Error 1 make[3]: *** Waiting for unfinished jobs.... mv -f .deps/entrance_auth.Tpo .deps/entrance_auth.Po make[3]: Leaving directory `/home/nox/e17_cvs/e17/apps/entrance/src/client' make[2]: *** [all-recursive] Error 1 make[2]: Leaving directory `/home/nox/e17_cvs/e17/apps/entrance/src' make[1]: *** [all] Error 2 make[1]: Leaving directory `/home/nox/e17_cvs/e17/apps/entrance/src' make: *** [all-recursive] Error 1 --------------------------------------------------------------------------------