dev@disse:~/build/KDE/kdegraphics/okular$ make makeobj[0]: Entering directory `/home/dev/build/KDE/kdegraphics/okular' [ 16%] Built target okularcore [ 42%] Built target okularpart [ 45%] Built target okular [ 45%] Building CXX object okular/generators/poppler/CMakeFiles/okularGenerator_poppler.dir/generator_pdf.o /home/dev/src/KDE/kdegraphics/okular/generators/poppler/generator_pdf.cpp: In member function ?virtual int PDFEmbeddedFile::size() const?: /home/dev/src/KDE/kdegraphics/okular/generators/poppler/generator_pdf.cpp:77: error: ?class Poppler::EmbeddedFile? has no member named ?size? make[2]: *** [okular/generators/poppler/CMakeFiles/okularGenerator_poppler.dir/generator_pdf.o] Error 1 make[1]: *** [okular/generators/poppler/CMakeFiles/okularGenerator_poppler.dir/all] Error 2 make: *** [all] Error 2 makeobj[0]: Leaving directory `/home/dev/build/KDE/kdegraphics/okular'