dev@disse:~/src/KDE/kdegraphics$ cmakekde
-- Found Qt-Version 4.3.0-snapshot-20070508
-- Found X11: /usr/lib/libX11.so
-- Found KDE 4.0 include dir: /home/dev/kde/include
-- Found KDE 4 library dir: /home/dev/kde/lib
-- Found KDE4 kconfig_compiler preprocessor: /home/dev/kde/bin/kconfig_compiler
-- Found KDE4 automoc: /home/dev/kde/bin/kde4automoc
-- Found Strigi: /home/dev/kde/lib/libstreamanalyzer.so
-- Found Strigi: /home/dev/kde/lib/libstreams.so
-- Make sure Strigi is a recent SVN version!
-- ** svn://anonsvn.kde.org/home/kde/trunk/kdesupport/strigi
-- Found JPEG: /usr/lib/libjpeg.so
-- Found Freetype: -lfreetype -lz
-- Found JPEG: /usr/lib/libjpeg.so
--
----------------------------------------------------------------------------------
-- The following list of OPTIONAL packages were located on your system. --
-- You will have all the following features available from this software. --
----------------------------------------------------------------------------------
+ Exiv2 library
+ Poppler-Qt4
+ libgs
+ libCHM
+ libdjvulibre
+ libTIFF
+ JPEG
----------------------------------------------------------------------------------
-- The following list of OPTIONAL packages could NOT be located on your system. --
-- Consider installing them to enable more features from this software. --
----------------------------------------------------------------------------------
+ libgphoto2: Required to build kamera project
+ libsane: Sane lib is needed to build libkscan
+ xf86vmode.h: xvidmode extensions are needed to build kgamma
-- Configuring done
-- Generating done
-- Build files have been written to: /home/dev/build/KDE/kdegraphics
makeobj[0]: Entering directory `/home/dev/build/KDE/kdegraphics'
/usr/bin/cmake -H/home/dev/src/KDE/kdegraphics -B/home/dev/build/KDE/kdegraphics --check-build-system CMakeFiles/Makefile.cmake 0
/usr/bin/cmake -E cmake_progress_start /home/dev/build/KDE/kdegraphics/CMakeFiles 96
/usr/bin/make -f CMakeFiles/Makefile2 all
make[1]: Entering directory `/home/dev/build/KDE/kdegraphics'
/usr/bin/make -f doc/ksnapshot/CMakeFiles/handbook.dir/build.make doc/ksnapshot/CMakeFiles/handbook.dir/build
/usr/bin/make -f doc/kghostview/CMakeFiles/handbook.dir/build.make doc/kghostview/CMakeFiles/handbook.dir/build
make[2]: Entering directory `/home/dev/build/KDE/kdegraphics'
make[2]: Nothing to be done for `doc/ksnapshot/CMakeFiles/handbook.dir/build'.
make[2]: Entering directory `/home/dev/build/KDE/kdegraphics'
make[2]: Nothing to be done for `doc/kghostview/CMakeFiles/handbook.dir/build'.
make[2]: Leaving directory `/home/dev/build/KDE/kdegraphics'
make[2]: Leaving directory `/home/dev/build/KDE/kdegraphics'
/usr/bin/cmake -E cmake_progress_report /home/dev/build/KDE/kdegraphics/CMakeFiles
/usr/bin/cmake -E cmake_progress_report /home/dev/build/KDE/kdegraphics/CMakeFiles
[ 0%] [ 0%] Built target handbook
Built target handbook
/usr/bin/make -f doc/kamera/CMakeFiles/handbook.dir/build.make doc/kamera/CMakeFiles/handbook.dir/build
/usr/bin/make -f doc/kgamma/CMakeFiles/handbook.dir/build.make doc/kgamma/CMakeFiles/handbook.dir/build
make[2]: Entering directory `/home/dev/build/KDE/kdegraphics'
make[2]: Nothing to be done for `doc/kamera/CMakeFiles/handbook.dir/build'.
make[2]: Leaving directory `/home/dev/build/KDE/kdegraphics'
make[2]: Entering directory `/home/dev/build/KDE/kdegraphics'
make[2]: Nothing to be done for `doc/kgamma/CMakeFiles/handbook.dir/build'.
make[2]: Leaving directory `/home/dev/build/KDE/kdegraphics'
/usr/bin/cmake -E cmake_progress_report /home/dev/build/KDE/kdegraphics/CMakeFiles 1
/usr/bin/cmake -E cmake_progress_report /home/dev/build/KDE/kdegraphics/CMakeFiles
[ 1%] [ 1%] Built target handbook
/usr/bin/make -f doc/kolourpaint/CMakeFiles/handbook.dir/build.make doc/kolourpaint/CMakeFiles/handbook.dir/build
Built target handbook
make[2]: Entering directory `/home/dev/build/KDE/kdegraphics'
make[2]: Nothing to be done for `doc/kolourpaint/CMakeFiles/handbook.dir/build'.
make[2]: Leaving directory `/home/dev/build/KDE/kdegraphics'
/usr/bin/cmake -E cmake_progress_report /home/dev/build/KDE/kdegraphics/CMakeFiles 2
/usr/bin/make -f doc/kruler/CMakeFiles/handbook.dir/build.make doc/kruler/CMakeFiles/handbook.dir/build
[ 2%] Built target handbook
/usr/bin/make -f doc/okular/CMakeFiles/handbook.dir/build.make doc/okular/CMakeFiles/handbook.dir/build
make[2]: Entering directory `/home/dev/build/KDE/kdegraphics'
make[2]: Nothing to be done for `doc/kruler/CMakeFiles/handbook.dir/build'.
make[2]: Leaving directory `/home/dev/build/KDE/kdegraphics'
make[2]: Entering directory `/home/dev/build/KDE/kdegraphics'
make[2]: Nothing to be done for `doc/okular/CMakeFiles/handbook.dir/build'.
make[2]: Leaving directory `/home/dev/build/KDE/kdegraphics'
/usr/bin/cmake -E cmake_progress_report /home/dev/build/KDE/kdegraphics/CMakeFiles
[ 2%] /usr/bin/cmake -E cmake_progress_report /home/dev/build/KDE/kdegraphics/CMakeFiles
[ 2%] Built target handbook
Built target handbook
/usr/bin/make -f ksnapshot/CMakeFiles/kbackgroundsnapshot.dir/build.make ksnapshot/CMakeFiles/kbackgroundsnapshot.dir/depend
/usr/bin/make -f ksnapshot/CMakeFiles/ksnapshot.dir/build.make ksnapshot/CMakeFiles/ksnapshot.dir/depend
make[2]: Entering directory `/home/dev/build/KDE/kdegraphics'
make[2]: Nothing to be done for `ksnapshot/CMakeFiles/kbackgroundsnapshot.dir/depend'.
make[2]: Leaving directory `/home/dev/build/KDE/kdegraphics'
/usr/bin/make -f ksnapshot/CMakeFiles/kbackgroundsnapshot.dir/build.make ksnapshot/CMakeFiles/kbackgroundsnapshot.dir/build
make[2]: Entering directory `/home/dev/build/KDE/kdegraphics'
make[2]: Nothing to be done for `ksnapshot/CMakeFiles/ksnapshot.dir/depend'.
make[2]: Leaving directory `/home/dev/build/KDE/kdegraphics'
/usr/bin/make -f ksnapshot/CMakeFiles/ksnapshot.dir/build.make ksnapshot/CMakeFiles/ksnapshot.dir/build
make[2]: Entering directory `/home/dev/build/KDE/kdegraphics'
make[2]: Nothing to be done for `ksnapshot/CMakeFiles/kbackgroundsnapshot.dir/build'.
make[2]: Leaving directory `/home/dev/build/KDE/kdegraphics'
/usr/bin/cmake -E cmake_progress_report /home/dev/build/KDE/kdegraphics/CMakeFiles 3 4 5
[ 5%] Built target kbackgroundsnapshot
/usr/bin/make -f gwenview/lib/CMakeFiles/gwenviewlib.dir/build.make gwenview/lib/CMakeFiles/gwenviewlib.dir/depend
make[2]: Entering directory `/home/dev/build/KDE/kdegraphics'
make[2]: Nothing to be done for `ksnapshot/CMakeFiles/ksnapshot.dir/build'.
make[2]: Leaving directory `/home/dev/build/KDE/kdegraphics'
/usr/bin/cmake -E cmake_progress_report /home/dev/build/KDE/kdegraphics/CMakeFiles 6 7 8 9 10
[ 10%] make[2]: Entering directory `/home/dev/build/KDE/kdegraphics'
make[2]: Nothing to be done for `gwenview/lib/CMakeFiles/gwenviewlib.dir/depend'.
make[2]: Leaving directory `/home/dev/build/KDE/kdegraphics'
/usr/bin/make -f gwenview/lib/CMakeFiles/gwenviewlib.dir/build.make gwenview/lib/CMakeFiles/gwenviewlib.dir/build
Built target ksnapshot
/usr/bin/make -f okular/CMakeFiles/okularcore.dir/build.make okular/CMakeFiles/okularcore.dir/depend
make[2]: Entering directory `/home/dev/build/KDE/kdegraphics'
make[2]: Nothing to be done for `okular/CMakeFiles/okularcore.dir/depend'.
make[2]: Leaving directory `/home/dev/build/KDE/kdegraphics'
/usr/bin/make -f okular/CMakeFiles/okularcore.dir/build.make okular/CMakeFiles/okularcore.dir/build
make[2]: Entering directory `/home/dev/build/KDE/kdegraphics'
make[2]: Nothing to be done for `gwenview/lib/CMakeFiles/gwenviewlib.dir/build'.
make[2]: Leaving directory `/home/dev/build/KDE/kdegraphics'
/usr/bin/cmake -E cmake_progress_report /home/dev/build/KDE/kdegraphics/CMakeFiles 14 15 16 17 18 19 20 21 22
[ 19%] Built target gwenviewlib
/usr/bin/make -f okular/shell/CMakeFiles/okular.dir/build.make okular/shell/CMakeFiles/okular.dir/depend
make[2]: Entering directory `/home/dev/build/KDE/kdegraphics'
make[2]: Nothing to be done for `okular/shell/CMakeFiles/okular.dir/depend'.
make[2]: Leaving directory `/home/dev/build/KDE/kdegraphics'
/usr/bin/make -f okular/shell/CMakeFiles/okular.dir/build.make okular/shell/CMakeFiles/okular.dir/build
make[2]: Entering directory `/home/dev/build/KDE/kdegraphics'
make[2]: Nothing to be done for `okular/CMakeFiles/okularcore.dir/build'.
make[2]: Leaving directory `/home/dev/build/KDE/kdegraphics'
/usr/bin/cmake -E cmake_progress_report /home/dev/build/KDE/kdegraphics/CMakeFiles 29 30 31 32 33 34 35 36 37 38 39
[ 31%] Built target okularcore
/usr/bin/make -f okular/generators/chm/kio-msits/CMakeFiles/kio_msits.dir/build.make okular/generators/chm/kio-msits/CMakeFiles/kio_msits.dir/depend
make[2]: Entering directory `/home/dev/build/KDE/kdegraphics'
make[2]: Nothing to be done for `okular/generators/chm/kio-msits/CMakeFiles/kio_msits.dir/depend'.
make[2]: Leaving directory `/home/dev/build/KDE/kdegraphics'
/usr/bin/make -f okular/generators/chm/kio-msits/CMakeFiles/kio_msits.dir/build.make okular/generators/chm/kio-msits/CMakeFiles/kio_msits.dir/build
make[2]: Entering directory `/home/dev/build/KDE/kdegraphics'
make[2]: Nothing to be done for `okular/shell/CMakeFiles/okular.dir/build'.
make[2]: Leaving directory `/home/dev/build/KDE/kdegraphics'
/usr/bin/cmake -E cmake_progress_report /home/dev/build/KDE/kdegraphics/CMakeFiles 59 60
[ 33%] Built target okular
/usr/bin/make -f okular/generators/djvu/CMakeFiles/okularGenerator_djvu.dir/build.make okular/generators/djvu/CMakeFiles/okularGenerator_djvu.dir/depend
make[2]: Entering directory `/home/dev/build/KDE/kdegraphics'
make[2]: Nothing to be done for `okular/generators/chm/kio-msits/CMakeFiles/kio_msits.dir/build'.
make[2]: Leaving directory `/home/dev/build/KDE/kdegraphics'
make[2]: Entering directory `/home/dev/build/KDE/kdegraphics'
make[2]: Nothing to be done for `okular/generators/djvu/CMakeFiles/okularGenerator_djvu.dir/depend'.
make[2]: Leaving directory `/home/dev/build/KDE/kdegraphics'
/usr/bin/cmake -E cmake_progress_report /home/dev/build/KDE/kdegraphics/CMakeFiles 72
/usr/bin/make -f okular/generators/djvu/CMakeFiles/okularGenerator_djvu.dir/build.make okular/generators/djvu/CMakeFiles/okularGenerator_djvu.dir/build
[ 34%] Built target kio_msits
/usr/bin/make -f okular/generators/dvi/CMakeFiles/okularGenerator_dvi.dir/build.make okular/generators/dvi/CMakeFiles/okularGenerator_dvi.dir/depend
make[2]: Entering directory `/home/dev/build/KDE/kdegraphics'
make[2]: Nothing to be done for `okular/generators/djvu/CMakeFiles/okularGenerator_djvu.dir/build'.
make[2]: Leaving directory `/home/dev/build/KDE/kdegraphics'
/usr/bin/cmake -E cmake_progress_report /home/dev/build/KDE/kdegraphics/CMakeFiles 73 74
[ 36%] Built target okularGenerator_djvu
/usr/bin/make -f okular/generators/tiff/CMakeFiles/okularGenerator_tiff.dir/build.make okular/generators/tiff/CMakeFiles/okularGenerator_tiff.dir/depend
make[2]: Entering directory `/home/dev/build/KDE/kdegraphics'
make[2]: Nothing to be done for `okular/generators/tiff/CMakeFiles/okularGenerator_tiff.dir/depend'.
make[2]: Leaving directory `/home/dev/build/KDE/kdegraphics'
/usr/bin/make -f okular/generators/tiff/CMakeFiles/okularGenerator_tiff.dir/build.make okular/generators/tiff/CMakeFiles/okularGenerator_tiff.dir/build
make[2]: Entering directory `/home/dev/build/KDE/kdegraphics'
make[2]: Nothing to be done for `okular/generators/tiff/CMakeFiles/okularGenerator_tiff.dir/build'.
make[2]: Leaving directory `/home/dev/build/KDE/kdegraphics'
/usr/bin/cmake -E cmake_progress_report /home/dev/build/KDE/kdegraphics/CMakeFiles 87
[ 37%] Built target okularGenerator_tiff
/usr/bin/make -f okular/generators/xps/CMakeFiles/okularGenerator_xps.dir/build.make okular/generators/xps/CMakeFiles/okularGenerator_xps.dir/depend
make[2]: Entering directory `/home/dev/build/KDE/kdegraphics'
make[2]: Nothing to be done for `okular/generators/xps/CMakeFiles/okularGenerator_xps.dir/depend'.
make[2]: Leaving directory `/home/dev/build/KDE/kdegraphics'
/usr/bin/make -f okular/generators/xps/CMakeFiles/okularGenerator_xps.dir/build.make okular/generators/xps/CMakeFiles/okularGenerator_xps.dir/build
make[2]: Entering directory `/home/dev/build/KDE/kdegraphics'
make[2]: Nothing to be done for `okular/generators/dvi/CMakeFiles/okularGenerator_dvi.dir/depend'.
make[2]: Leaving directory `/home/dev/build/KDE/kdegraphics'
/usr/bin/make -f okular/generators/dvi/CMakeFiles/okularGenerator_dvi.dir/build.make okular/generators/dvi/CMakeFiles/okularGenerator_dvi.dir/build
make[2]: Entering directory `/home/dev/build/KDE/kdegraphics'
make[2]: Nothing to be done for `okular/generators/xps/CMakeFiles/okularGenerator_xps.dir/build'.
make[2]: Leaving directory `/home/dev/build/KDE/kdegraphics'
/usr/bin/cmake -E cmake_progress_report /home/dev/build/KDE/kdegraphics/CMakeFiles 88 89
[ 39%] Built target okularGenerator_xps
/usr/bin/make -f okular/generators/ooo/CMakeFiles/okularGenerator_ooo.dir/build.make okular/generators/ooo/CMakeFiles/okularGenerator_ooo.dir/depend
make[2]: Entering directory `/home/dev/build/KDE/kdegraphics'
make[2]: Nothing to be done for `okular/generators/ooo/CMakeFiles/okularGenerator_ooo.dir/depend'.
make[2]: Leaving directory `/home/dev/build/KDE/kdegraphics'
/usr/bin/make -f okular/generators/ooo/CMakeFiles/okularGenerator_ooo.dir/build.make okular/generators/ooo/CMakeFiles/okularGenerator_ooo.dir/build
make[2]: Entering directory `/home/dev/build/KDE/kdegraphics'
make[2]: Nothing to be done for `okular/generators/dvi/CMakeFiles/okularGenerator_dvi.dir/build'.
make[2]: Leaving directory `/home/dev/build/KDE/kdegraphics'
/usr/bin/cmake -E cmake_progress_report /home/dev/build/KDE/kdegraphics/CMakeFiles 75 76 77 78 79 80 81 82 83 84 85 86
make[2]: Entering directory `/home/dev/build/KDE/kdegraphics'
make[2]: Nothing to be done for `okular/generators/ooo/CMakeFiles/okularGenerator_ooo.dir/build'.
make[2]: Leaving directory `/home/dev/build/KDE/kdegraphics'
[ 52%] /usr/bin/cmake -E cmake_progress_report /home/dev/build/KDE/kdegraphics/CMakeFiles 90 91 92
Built target okularGenerator_dvi
[ 55%] /usr/bin/make -f okular/generators/fictionbook/CMakeFiles/okularGenerator_fb.dir/build.make okular/generators/fictionbook/CMakeFiles/okularGenerator_fb.dir/depend
Built target okularGenerator_ooo
/usr/bin/make -f okular/generators/comicbook/CMakeFiles/okularGenerator_comicbook.dir/build.make okular/generators/comicbook/CMakeFiles/okularGenerator_comicbook.dir/depend
make[2]: Entering directory `/home/dev/build/KDE/kdegraphics'
make[2]: Nothing to be done for `okular/generators/fictionbook/CMakeFiles/okularGenerator_fb.dir/depend'.
make[2]: Leaving directory `/home/dev/build/KDE/kdegraphics'
/usr/bin/make -f okular/generators/fictionbook/CMakeFiles/okularGenerator_fb.dir/build.make okular/generators/fictionbook/CMakeFiles/okularGenerator_fb.dir/build
make[2]: Entering directory `/home/dev/build/KDE/kdegraphics'
make[2]: Nothing to be done for `okular/generators/comicbook/CMakeFiles/okularGenerator_comicbook.dir/depend'.
make[2]: Leaving directory `/home/dev/build/KDE/kdegraphics'
/usr/bin/make -f okular/generators/comicbook/CMakeFiles/okularGenerator_comicbook.dir/build.make okular/generators/comicbook/CMakeFiles/okularGenerator_comicbook.dir/build
make[2]: Entering directory `/home/dev/build/KDE/kdegraphics'
make[2]: Nothing to be done for `okular/generators/fictionbook/CMakeFiles/okularGenerator_fb.dir/build'.
make[2]: Leaving directory `/home/dev/build/KDE/kdegraphics'
/usr/bin/cmake -E cmake_progress_report /home/dev/build/KDE/kdegraphics/CMakeFiles 93 94
make[2]: Entering directory `/home/dev/build/KDE/kdegraphics'
make[2]: Nothing to be done for `okular/generators/comicbook/CMakeFiles/okularGenerator_comicbook.dir/build'.
make[2]: Leaving directory `/home/dev/build/KDE/kdegraphics'
/usr/bin/cmake -E cmake_progress_report /home/dev/build/KDE/kdegraphics/CMakeFiles 95 96
[ 57%] [ 59%] Built target okularGenerator_fb
Built target okularGenerator_comicbook
/usr/bin/make -f okular/generators/plucker/CMakeFiles/okularGenerator_plucker.dir/build.make okular/generators/plucker/CMakeFiles/okularGenerator_plucker.dir/depend
make[2]: Entering directory `/home/dev/build/KDE/kdegraphics'
make[2]: Nothing to be done for `okular/generators/plucker/CMakeFiles/okularGenerator_plucker.dir/depend'.
make[2]: Leaving directory `/home/dev/build/KDE/kdegraphics'
/usr/bin/make -f okular/generators/plucker/CMakeFiles/okularGenerator_plucker.dir/build.make okular/generators/plucker/CMakeFiles/okularGenerator_plucker.dir/build
make[2]: Entering directory `/home/dev/build/KDE/kdegraphics'
make[2]: Nothing to be done for `okular/generators/plucker/CMakeFiles/okularGenerator_plucker.dir/build'.
make[2]: Leaving directory `/home/dev/build/KDE/kdegraphics'
/usr/bin/cmake -E cmake_progress_report /home/dev/build/KDE/kdegraphics/CMakeFiles 97 98 99 100
[ 63%] Built target okularGenerator_plucker
/usr/bin/make -f gwenview/app/CMakeFiles/gwenview.dir/build.make gwenview/app/CMakeFiles/gwenview.dir/depend
/usr/bin/make -f gwenview/part/CMakeFiles/gvpart.dir/build.make gwenview/part/CMakeFiles/gvpart.dir/depend
make[2]: Entering directory `/home/dev/build/KDE/kdegraphics'
make[2]: Entering directory `/home/dev/build/KDE/kdegraphics'
make[2]: Nothing to be done for `gwenview/part/CMakeFiles/gvpart.dir/depend'.
make[2]: Leaving directory `/home/dev/build/KDE/kdegraphics'
make[2]: Nothing to be done for `gwenview/app/CMakeFiles/gwenview.dir/depend'.
make[2]: Leaving directory `/home/dev/build/KDE/kdegraphics'
/usr/bin/make -f gwenview/part/CMakeFiles/gvpart.dir/build.make gwenview/part/CMakeFiles/gvpart.dir/build
/usr/bin/make -f gwenview/app/CMakeFiles/gwenview.dir/build.make gwenview/app/CMakeFiles/gwenview.dir/build
make[2]: Entering directory `/home/dev/build/KDE/kdegraphics'
make[2]: Nothing to be done for `gwenview/part/CMakeFiles/gvpart.dir/build'.
make[2]: Leaving directory `/home/dev/build/KDE/kdegraphics'
/usr/bin/cmake -E cmake_progress_report /home/dev/build/KDE/kdegraphics/CMakeFiles 23 24
[ 65%] Built target gvpart
/usr/bin/make -f okular/CMakeFiles/okularpart.dir/build.make okular/CMakeFiles/okularpart.dir/depend
make[2]: Entering directory `/home/dev/build/KDE/kdegraphics'
make[2]: Nothing to be done for `gwenview/app/CMakeFiles/gwenview.dir/build'.
make[2]: Leaving directory `/home/dev/build/KDE/kdegraphics'
/usr/bin/cmake -E cmake_progress_report /home/dev/build/KDE/kdegraphics/CMakeFiles 11 12 13
[ 68%] Built target gwenview
/usr/bin/make -f okular/generators/poppler/CMakeFiles/okularGenerator_poppler.dir/build.make okular/generators/poppler/CMakeFiles/okularGenerator_poppler.dir/depend
make[2]: Entering directory `/home/dev/build/KDE/kdegraphics'
make[2]: Nothing to be done for `okular/generators/poppler/CMakeFiles/okularGenerator_poppler.dir/depend'.
make[2]: Leaving directory `/home/dev/build/KDE/kdegraphics'
/usr/bin/make -f okular/generators/poppler/CMakeFiles/okularGenerator_poppler.dir/build.make okular/generators/poppler/CMakeFiles/okularGenerator_poppler.dir/build
make[2]: Entering directory `/home/dev/build/KDE/kdegraphics'
/usr/bin/cmake -E cmake_progress_report /home/dev/build/KDE/kdegraphics/CMakeFiles 61
[ 69%] Building CXX object okular/generators/poppler/CMakeFiles/okularGenerator_poppler.dir/generator_pdf.o
/usr/bin/c++ -DokularGenerator_poppler_EXPORTS -Wnon-virtual-dtor -Wno-long-long -ansi -Wundef -Wcast-align -Wchar-subscripts -Wall -W -Wpointer-arith -Wformat-security -fno-exceptions -fno-check-new -fno-common -fvisibility=hidden -g3 -fno-inline -fPIC -I/home/dev/build/KDE/kdegraphics/okular/generators/poppler -I/home/dev/src/KDE/kdegraphics/okular/generators/poppler -I/home/dev/src/KDE/kdegraphics -I/home/dev/build/KDE/kdegraphics -I/home/dev/build/KDE/kdegraphics/okular -I/home/dev/src/KDE/kdegraphics/okular/generators/poppler/../.. -I/home/dev/src/qt-copy/include -I/home/dev/src/qt-copy/include/Qt -I/home/dev/src/qt-copy/mkspecs/default -I/home/dev/src/qt-copy/include/QtCore -I/home/dev/src/qt-copy/include/QtGui -I/home/dev/src/qt-copy/include/Qt3Support -I/home/dev/src/qt-copy/include/QtAssistant -I/home/dev/src/qt-copy/include/QtDesigner -I/home/dev/src/qt-copy/include/QtNetwork -I/home/dev/src/qt-copy/include/QtOpenGL -I/home/dev/src/qt-copy/include/QtSql -I/home/dev/src/qt-copy/include/QtXml -I/home/dev/src/qt-copy/include/QtSvg -I/home/dev/src/qt-copy/include/QtScript -I/home/dev/src/qt-copy/include/QtUiTools -I/home/dev/src/qt-copy/include/QtTest -I/home/dev/src/qt-copy/include/QtDBus -I/home/dev/kde/include -I/home/dev/kde/include/KDE -I/usr/local/include -I/usr/local/include/poppler/qt4 -I/usr/local/include/poppler -D_BSD_SOURCE -D_XOPEN_SOURCE=500 -D_BSD_SOURCE -D_GNU_SOURCE -DQT_NO_STL -DQT_NO_CAST_TO_ASCII -D_REENTRANT -DKDE_DEPRECATED_WARNINGS -o okular/generators/poppler/CMakeFiles/okularGenerator_poppler.dir/generator_pdf.o -c /home/dev/src/KDE/kdegraphics/okular/generators/poppler/generator_pdf.cpp
make[2]: Entering directory `/home/dev/build/KDE/kdegraphics'
make[2]: Nothing to be done for `okular/CMakeFiles/okularpart.dir/depend'.
make[2]: Leaving directory `/home/dev/build/KDE/kdegraphics'
/usr/bin/make -f okular/CMakeFiles/okularpart.dir/build.make okular/CMakeFiles/okularpart.dir/build
make[2]: Entering directory `/home/dev/build/KDE/kdegraphics'
make[2]: Nothing to be done for `okular/CMakeFiles/okularpart.dir/build'.
make[2]: Leaving directory `/home/dev/build/KDE/kdegraphics'
/usr/bin/cmake -E cmake_progress_report /home/dev/build/KDE/kdegraphics/CMakeFiles 40 41 42 43 44 45 46 47 48 49 50 51 52 53 54 55 56 57 58
[ 89%] Built target okularpart
/usr/bin/make -f okular/generators/ghostview/CMakeFiles/okularGenerator_ghostview.dir/build.make okular/generators/ghostview/CMakeFiles/okularGenerator_ghostview.dir/depend
make[2]: Entering directory `/home/dev/build/KDE/kdegraphics'
make[2]: Nothing to be done for `okular/generators/ghostview/CMakeFiles/okularGenerator_ghostview.dir/depend'.
make[2]: Leaving directory `/home/dev/build/KDE/kdegraphics'
/usr/bin/make -f okular/generators/ghostview/CMakeFiles/okularGenerator_ghostview.dir/build.make okular/generators/ghostview/CMakeFiles/okularGenerator_ghostview.dir/build
make[2]: Entering directory `/home/dev/build/KDE/kdegraphics'
make[2]: Nothing to be done for `okular/generators/ghostview/CMakeFiles/okularGenerator_ghostview.dir/build'.
make[2]: Leaving directory `/home/dev/build/KDE/kdegraphics'
/usr/bin/cmake -E cmake_progress_report /home/dev/build/KDE/kdegraphics/CMakeFiles 62 63 64 65 66
[ 94%] Built target okularGenerator_ghostview
/usr/bin/make -f okular/generators/kimgio/CMakeFiles/okularGenerator_kimgio.dir/build.make okular/generators/kimgio/CMakeFiles/okularGenerator_kimgio.dir/depend
make[2]: Entering directory `/home/dev/build/KDE/kdegraphics'
make[2]: Nothing to be done for `okular/generators/kimgio/CMakeFiles/okularGenerator_kimgio.dir/depend'.
make[2]: Leaving directory `/home/dev/build/KDE/kdegraphics'
/usr/bin/make -f okular/generators/kimgio/CMakeFiles/okularGenerator_kimgio.dir/build.make okular/generators/kimgio/CMakeFiles/okularGenerator_kimgio.dir/build
make[2]: Entering directory `/home/dev/build/KDE/kdegraphics'
make[2]: Nothing to be done for `okular/generators/kimgio/CMakeFiles/okularGenerator_kimgio.dir/build'.
make[2]: Leaving directory `/home/dev/build/KDE/kdegraphics'
/usr/bin/cmake -E cmake_progress_report /home/dev/build/KDE/kdegraphics/CMakeFiles 67 68
[ 96%] Built target okularGenerator_kimgio
/usr/bin/make -f okular/generators/chm/CMakeFiles/okularGenerator_chmlib.dir/build.make okular/generators/chm/CMakeFiles/okularGenerator_chmlib.dir/depend
make[2]: Entering directory `/home/dev/build/KDE/kdegraphics'
make[2]: Nothing to be done for `okular/generators/chm/CMakeFiles/okularGenerator_chmlib.dir/depend'.
make[2]: Leaving directory `/home/dev/build/KDE/kdegraphics'
/usr/bin/make -f okular/generators/chm/CMakeFiles/okularGenerator_chmlib.dir/build.make okular/generators/chm/CMakeFiles/okularGenerator_chmlib.dir/build
make[2]: Entering directory `/home/dev/build/KDE/kdegraphics'
make[2]: Nothing to be done for `okular/generators/chm/CMakeFiles/okularGenerator_chmlib.dir/build'.
make[2]: Leaving directory `/home/dev/build/KDE/kdegraphics'
/usr/bin/cmake -E cmake_progress_report /home/dev/build/KDE/kdegraphics/CMakeFiles 69 70 71
[100%] Built target okularGenerator_chmlib
/home/dev/src/KDE/kdegraphics/okular/generators/poppler/generator_pdf.cpp: In function ?Okular::Action* createLinkFromPopplerLink(const Poppler::Link*, const Poppler::Document*)?:
/home/dev/src/KDE/kdegraphics/okular/generators/poppler/generator_pdf.cpp:183: warning: enumeration value ?Sound? not handled in switch
/home/dev/src/KDE/kdegraphics/okular/generators/poppler/generator_pdf.cpp: In member function ?virtual void PDFGenerator::generatePixmap(Okular::PixmapRequest*)?:
/home/dev/src/KDE/kdegraphics/okular/generators/poppler/generator_pdf.cpp:786: error: ?class Poppler::Page? has no member named ?splashRenderToPixmap?
/home/dev/src/KDE/kdegraphics/okular/generators/poppler/generator_pdf.cpp: In member function ?virtual bool PDFGenerator::print(KPrinter&)?:
/home/dev/src/KDE/kdegraphics/okular/generators/poppler/generator_pdf.cpp:927: error: ?class Poppler::Document? has no member named ?print?
/home/dev/src/KDE/kdegraphics/okular/generators/poppler/generator_pdf.cpp: In member function ?virtual void PDFPixmapGeneratorThread::run()?:
/home/dev/src/KDE/kdegraphics/okular/generators/poppler/generator_pdf.cpp:1727: error: ?class Poppler::Page? has no member named ?splashRenderToImage?
make[2]: *** [okular/generators/poppler/CMakeFiles/okularGenerator_poppler.dir/generator_pdf.o] Error 1
make[2]: Leaving directory `/home/dev/build/KDE/kdegraphics'
make[1]: *** [okular/generators/poppler/CMakeFiles/okularGenerator_poppler.dir/all] Error 2
make[1]: Leaving directory `/home/dev/build/KDE/kdegraphics'
make: *** [all] Error 2
makeobj[0]: Leaving directory `/home/dev/build/KDE/kdegraphics'