[ 0%] Generating kdecore_automoc.cpp cd /home/kde-devel/kde/build/kdelibs/kdecore && ../bin/kde4automoc.shell /home/kde-devel/kde/build/kdelibs/kdecore/kdecore_automoc.cpp /home/kde-devel/kde/src/kdelibs/kdecore /home/kde-devel/kde/build/kdelibs/kdecore Could\ not\ find\ mkspecs\ for\ your\ QMAKESPEC(linux-g++)\ after\ trying /bin/sh: -c: line 0: syntax error near unexpected token `(' /bin/sh: -c: line 0: `cd /home/kde-devel/kde/build/kdelibs/kdecore && ../bin/kde4automoc.shell /home/kde-devel/kde/build/kdelibs/kdecore/kdecore_automoc.cpp /home/kde-devel/kde/src/kdelibs/kdecore /home/kde-devel/kde/build/kdelibs/kdecore Could\ not\ find\ mkspecs\ for\ your\ QMAKESPEC(linux-g++)\ after\ trying' make[2]: *** [kdecore/kdecore_automoc.cpp] Error 2 make[2]: Leaving directory `/home/kde-devel/kde/build/kdelibs' make[1]: *** [kdecore/CMakeFiles/kdecore.dir/all] Error 2 make[1]: Leaving directory `/home/kde-devel/kde/build/kdelibs' make: *** [all] Error 2 makeobj[0]: Leaving directory `/home/kde-devel/kde/build/kdelibs'