cc1: error: bad value (k8) for -march= switch cc1: error: bad value (k8) for -mcpu= switch make[2]: *** [gengenrtl.o] Error 1 make[2]: Leaving directory `/var/tmp/portage/sys-devel/gcc-3.3.6-r1/work/build/gcc' make[1]: *** [stage2_build] Error 2 make[1]: *** Waiting for unfinished jobs.... echo timestamp > clean_s1 make[1]: Leaving directory `/var/tmp/portage/sys-devel/gcc-3.3.6-r1/work/build/gcc' make: *** [bootstrap-lean] Error 2 !!! ERROR: sys-devel/gcc-3.3.6-r1 failed. Call stack: ebuild.sh, line 1621: Called dyn_compile ebuild.sh, line 973: Called qa_call 'src_compile' ebuild.sh, line 44: Called src_compile ebuild.sh, line 1311: Called toolchain_src_compile toolchain.eclass, line 26: Called gcc_src_compile toolchain.eclass, line 1546: Called gcc_do_make toolchain.eclass, line 1420: Called die