Using 2.6.x kernel build system. make: entrant dans le répertoire « /tmp/vmware-config1/vmmon-only » make -C /lib/modules/2.6.22.1-27.fc7/build/include/.. SUBDIRS=$PWD SRCROOT=$PWD/. modules make[1]: entrant dans le répertoire « /usr/src/kernels/2.6.22.1-27.fc7-i686 » CC [M] /tmp/vmware-config1/vmmon-only/linux/driver.o In file included from /tmp/vmware-config1/vmmon-only/linux/driver.c:80: /tmp/vmware-config1/vmmon-only/./include/compat_kernel.h:21: erreur: expected declaration specifiers or ‘...’ before ‘compat_exit’ /tmp/vmware-config1/vmmon-only/./include/compat_kernel.h:21: erreur: expected declaration specifiers or ‘...’ before ‘exit_code’ /tmp/vmware-config1/vmmon-only/./include/compat_kernel.h:21: attention : type defaults to ‘int’ in declaration of ‘_syscall1’ make[2]: *** [/tmp/vmware-config1/vmmon-only/linux/driver.o] Erreur 1 make[1]: *** [_module_/tmp/vmware-config1/vmmon-only] Erreur 2 make[1]: quittant le répertoire « /usr/src/kernels/2.6.22.1-27.fc7-i686 » make: *** [vmmon.ko] Erreur 2 make: quittant le répertoire « /tmp/vmware-config1/vmmon-only » Unable to build the vmmon module. For more information on how to troubleshoot module-related problems, please visit our Web site at "http://www.vmware.com/download/modules/modules.html" and "http://www.vmware.com/support/reference/linux/prebuilt_modules_linux.html". Execution aborted. VIEILLE MERDE DE QUENTIN